{
  "posts": [
    {
      "id": "p1",
      "title": "Post 1",
      "content": "This is the content of post 1."
    },
    {
      "id": "9b63",
      "title": "altijd",
      "content": "wat"
    },
    {
      "id": "4158",
      "title": "d",
      "content": "f"
    }
  ],
  "comments": [
    {
      "id": "1",
      "postId": "p1",
      "text": "Comment 1 for post 1"
    },
    {
      "id": "2",
      "postId": "p1",
      "text": "Comment 2 for post 1"
    },
    {
      "id": "3",
      "postId": null,
      "text": "Comment 1 for post 2"
    }
  ]
}