{
  "persons": [
    {
      "id": 1,
      "firstName": "Jos",
      "lastName": "Vertommen",
      "dateOfBirth": "1974-03-23",
      "gender": "M",
      "married": true,
      "image": "https://via.placeholder.com/200x80.png/74E323/000?text=Jos",
      "yearsService": 12
    },
    {
      "id": 2,
      "firstName": "Jan",
      "lastName": "Beton",
      "dateOfBirth": "1989-06-12",
      "gender": "M",
      "married": false,
      "image": "https://via.placeholder.com/200x80.png/89A612/000?text=Jan",
      "yearsService": 2
    },
    {
      "id": 3,
      "firstName": "Marie",
      "lastName": "Vertessen",
      "dateOfBirth": "1988-12-23",
      "gender": "F",
      "image": "https://via.placeholder.com/200x80.png/881223/000?text=Marie",
      "married": true,
      "yearsService": 21
    },
    {
      "id": 4,
      "firstName": "Erica",
      "lastName": "Gijssen",
      "dateOfBirth": "1997-04-23",
      "gender": "X",
      "image": "https://via.placeholder.com/200x80.png/97E423/000?text=Erica",
      "married": false,
      "yearsService": 10
    },
    {
      "id": 5,
      "firstName": "Dirk",
      "lastName": "Vervellen",
      "dateOfBirth": "2005-05-11",
      "gender": "M",
      "image": "https://via.placeholder.com/200x80.png/551/FFF?text=Dirk",
      "married": true,
      "yearsService": 7
    },
    {
      "id": 6,
      "firstName": "Thomas",
      "lastName": "Janssen",
      "dateOfBirth": "1979-04-23",
      "gender": "M",
      "image": "https://via.placeholder.com/200x80.png/943/FFF?text=Thomas",
      "married": true,
      "yearsService": 4
    },
    {
      "id": 7,
      "firstName": "Elke",
      "lastName": "Schepers",
      "dateOfBirth": "1967-03-23",
      "gender": "F",
      "image": "https://via.placeholder.com/200x80.png/733/FFF?text=Elke",
      "married": false,
      "yearsService": 7
    },
    {
      "id": 8,
      "firstName": "Miriam",
      "lastName": "Vervloed",
      "dateOfBirth": "1956-10-23",
      "gender": "F",
      "image": "https://via.placeholder.com/200x80.png/603/FFF?text=Miriam",
      "married": false,
      "yearsService": 10
    },
    {
      "id": 9,
      "firstName": "Ignace",
      "lastName": "Bruyns",
      "dateOfBirth": "2008-11-23",
      "gender": "M",
      "image": "https://via.placeholder.com/200x80.png/813/FFF?text=Ignace",
      "married": false,
      "yearsService": 21
    },
    {
      "id": 10,
      "firstName": "Seppe",
      "lastName": "Schrijvers",
      "dateOfBirth": "1990-12-23",
      "gender": "M",
      "image": "https://via.placeholder.com/200x80.png/023/FFF?text=Seppe",
      "married": true,
      "yearsService": 18
    },
    {
      "id": 11,
      "firstName": "Suzy",
      "lastName": "Verhulst",
      "dateOfBirth": "1972-09-23",
      "gender": "F",
      "image": "https://via.placeholder.com/200x80.png/293/FFF?text=Suzy",
      "married": false,
      "yearsService": 1
    },
    {
      "id": 12,
      "firstName": "Saartje",
      "lastName": "Koolzaet",
      "dateOfBirth": "2001-12-23",
      "gender": "F",
      "image": "https://via.placeholder.com/200x80.png/123/FFF?text=Saartje",
      "married": true,
      "yearsService": 0
    },
    {
      "id": 13,
      "firstName": "Mimi",
      "lastName": "Peters",
      "dateOfBirth": "2000-08-23",
      "gender": "F",
      "image": "https://via.placeholder.com/200x80.png/083/FFF?text=Mimi",
      "married": false,
      "yearsService": 12
    },
    {
      "id": 14,
      "firstName": "Emma",
      "lastName": "Geerts",
      "dateOfBirth": "2000-11-23",
      "gender": "F",
      "image": "https://via.placeholder.com/200x80.png/013/FFF?text=Emma",
      "married": true,
      "yearsService": 8
    },
    {
      "id": 15,
      "firstName": "Frits",
      "lastName": "Suikerbuyck",
      "dateOfBirth": "1999-01-23",
      "gender": "X",
      "image": "https://via.placeholder.com/200x80.png/913/FFF?text=Frits",
      "married": false,
      "yearsService": 3
    }
  ],
  "cars": [
    {
      "id": 1,
      "license": "1-AAA-123",
      "brand": "Opel",
      "model": "Zafira",
      "companyCar": true,
      "personId": 1
    },
    {
      "id": 4,
      "license": "1-DDD-123",
      "brand": "Renault",
      "model": "Espace",
      "companyCar": false,
      "personId": 4
    },
    {
      "id": 5,
      "license": "1-EEE-123",
      "brand": "Renault",
      "model": "Scenic",
      "companyCar": false,
      "personId": 5
    },
    {
      "id": 8,
      "license": "1-HHH-123",
      "brand": "Mercedes",
      "model": "ML",
      "companyCar": true,
      "personId": 8
    },
    {
      "id": 10,
      "license": "1-JJJ-123",
      "brand": "Peugeot",
      "model": "207",
      "companyCar": true,
      "personId": 10
    },
    {
      "id": 11,
      "license": "1-KKK-123",
      "brand": "Peugeot",
      "model": "308",
      "companyCar": true,
      "personId": 11
    },
    {
      "id": 12,
      "license": "1-LLL-123",
      "brand": "Peugeot",
      "model": "406",
      "companyCar": true,
      "personId": 12
    },
    {
      "id": 13,
      "license": "1-MMM-123",
      "brand": "Citroën",
      "model": "C1",
      "companyCar": true,
      "personId": 13
    },
    {
      "id": 14,
      "license": "1-NNN-123",
      "brand": "Citroën",
      "model": "C3",
      "companyCar": true,
      "personId": 14
    },
    {
      "id": 15,
      "license": "1-OOO-123",
      "brand": "Citroën",
      "model": "Spacetourer",
      "companyCar": true,
      "personId": 15
    },
    {
      "id": 16,
      "license": "1-PPP-123",
      "brand": "Mazda",
      "model": "CX-3",
      "companyCar": false,
      "personId": 1
    },
    {
      "id": 17,
      "license": "1-QQQ-123",
      "brand": "Mazda",
      "model": "CX-5",
      "companyCar": false,
      "personId": 2
    },
    {
      "id": 18,
      "license": "1-RRR-123",
      "brand": "Mazda",
      "model": "MX-5",
      "companyCar": false,
      "personId": 4
    },
    {
      "id": 19,
      "license": "1-SSS-123",
      "brand": "Suzuki",
      "model": "Jimny",
      "companyCar": false,
      "personId": 4
    },
    {
      "id": 20,
      "license": "1-TTT-123",
      "brand": "Suzuki",
      "model": "Vitara",
      "companyCar": false,
      "personId": 5
    }
  ]
}