@startuml
participant Actor
Actor -> BelastingController : berekenSuikerTax
activate BelastingController
BelastingController -> Winkel : getProductGamma
activate Winkel
Winkel --> BelastingController
deactivate Winkel
BelastingController -> ProductGamma : berekenSuikerTax
activate ProductGamma
ProductGamma -> Map : get
activate Map
Map --> ProductGamma
deactivate Map
ProductGamma -> Product : getPrijs
activate Product
Product --> ProductGamma
deactivate Product
ProductGamma -> Product : getSuikerGehalte
activate Product
Product --> ProductGamma
deactivate Product
ProductGamma -> Product : getCategorie
activate Product
Product --> ProductGamma
deactivate Product
ProductGamma -> ProductCategorie : getSuikerTaxSchaal
activate ProductCategorie
ProductCategorie --> ProductGamma
deactivate ProductCategorie
create Money
ProductGamma -> Money : new
activate Money
Money --> ProductGamma
deactivate Money
ProductGamma --> BelastingController
deactivate ProductGamma
return
@enduml