@startuml
skinparam style strictuml

Class Score{
  /amountOfMoney:float
  /valueOfOwnedProperties : float[]
  /totalWealth:float
  /playerName:String

  /endDate:Date
}

Class Game{
  main()
  startDate
  endDate
}


Class Player{
 name
 money
}

Class Board{}


Class Pawn{
 /position
}

Class Property{
 color:String
 housing:String
 /rent
 price
}

' Generalisation of a property
Class Square{
 name
 position
}

Game "1" -l- "2" Die : played with >
Game "1" -r- "1" Board : played on >
Board "1" -d- "40" Square : consists of >
Player "2..8" -u- Game : plays >
Player "1" -d- "1" Score : scores >
Player "1" -r- "1" Pawn : plays with >
Pawn "0..8" -r- "1" Square: landed on >
Player "0..1" -d- "*" Property : owns >
Property -u-|> Square
@enduml
