1999 The Mummy
1999 The Sixth Sense
1996 Scream
1995 Seven
1991 The Silence of the Lambs
1989 Henry: Portrait of a Serial Killer
1986 The Fly
1986 Manhunter
1984 Nightmare on Elm Street
1982 The Thing
1980 The Shining
202x My €0.02!
