[
  {
    "name": "Reece0",
    "birth_year": 2002,
    "gender": "f",
    "movies": [
      {
        "title": "dummytitle",
        "releaseYear": 1980,
        "director": "spielberg"
      },
      {
        "title": "dummytitle",
        "releaseYear": 1980,
        "director": "spielberg"
      }
    ]
  },
  {
    "name": "Keanu1",
    "birth_year": 1989,
    "gender": "m",
    "movies": [
      {
        "title": "dummytitle",
        "releaseYear": 1980,
        "director": "spielberg"
      },
      {
        "title": "dummytitle",
        "releaseYear": 1980,
        "director": "spielberg"
      }
    ]
  },
  {
    "name": "Reece2",
    "birth_year": 1996,
    "gender": "f",
    "movies": [
      {
        "title": "dummytitle",
        "releaseYear": 1980,
        "director": "spielberg"
      },
      {
        "title": "dummytitle",
        "releaseYear": 1980,
        "director": "spielberg"
      }
    ]
  },
  {
    "name": "Reece3",
    "birth_year": 1997,
    "gender": "f",
    "movies": [
      {
        "title": "dummytitle",
        "releaseYear": 1980,
        "director": "spielberg"
      },
      {
        "title": "dummytitle",
        "releaseYear": 1980,
        "director": "spielberg"
      }
    ]
  },
  {
    "name": "Keanu4",
    "birth_year": 1956,
    "gender": "m",
    "movies": [
      {
        "title": "dummytitle",
        "releaseYear": 1980,
        "director": "spielberg"
      },
      {
        "title": "dummytitle",
        "releaseYear": 1980,
        "director": "spielberg"
      }
    ]
  },
  {
    "name": "Reece5",
    "birth_year": 2003,
    "gender": "f",
    "movies": [
      {
        "title": "dummytitle",
        "releaseYear": 1980,
        "director": "spielberg"
      },
      {
        "title": "dummytitle",
        "releaseYear": 1980,
        "director": "spielberg"
      }
    ]
  },
  {
    "name": "Keanu6",
    "birth_year": 1960,
    "gender": "m",
    "movies": [
      {
        "title": "dummytitle",
        "releaseYear": 1980,
        "director": "spielberg"
      },
      {
        "title": "dummytitle",
        "releaseYear": 1980,
        "director": "spielberg"
      }
    ]
  },
  {
    "name": "Reece7",
    "birth_year": 1973,
    "gender": "f",
    "movies": [
      {
        "title": "dummytitle",
        "releaseYear": 1980,
        "director": "spielberg"
      },
      {
        "title": "dummytitle",
        "releaseYear": 1980,
        "director": "spielberg"
      }
    ]
  },
  {
    "name": "Keanu8",
    "birth_year": 1970,
    "gender": "m",
    "movies": [
      {
        "title": "dummytitle",
        "releaseYear": 1980,
        "director": "spielberg"
      },
      {
        "title": "dummytitle",
        "releaseYear": 1980,
        "director": "spielberg"
      }
    ]
  },
  {
    "name": "Reece9",
    "birth_year": 1999,
    "gender": "f",
    "movies": [
      {
        "title": "dummytitle",
        "releaseYear": 1980,
        "director": "spielberg"
      },
      {
        "title": "dummytitle",
        "releaseYear": 1980,
        "director": "spielberg"
      }
    ]
  },
  {
    "name": "Reece10",
    "birth_year": 1994,
    "gender": "f",
    "movies": [
      {
        "title": "dummytitle",
        "releaseYear": 1980,
        "director": "spielberg"
      },
      {
        "title": "dummytitle",
        "releaseYear": 1980,
        "director": "spielberg"
      }
    ]
  },
  {
    "name": "Reece11",
    "birth_year": 1974,
    "gender": "f",
    "movies": [
      {
        "title": "dummytitle",
        "releaseYear": 1980,
        "director": "spielberg"
      },
      {
        "title": "dummytitle",
        "releaseYear": 1980,
        "director": "spielberg"
      }
    ]
  },
  {
    "name": "Keanu12",
    "birth_year": 1933,
    "gender": "m",
    "movies": [
      {
        "title": "dummytitle",
        "releaseYear": 1980,
        "director": "spielberg"
      },
      {
        "title": "dummytitle",
        "releaseYear": 1980,
        "director": "spielberg"
      }
    ]
  },
  {
    "name": "Reece13",
    "birth_year": 1996,
    "gender": "f",
    "movies": [
      {
        "title": "dummytitle",
        "releaseYear": 1980,
        "director": "spielberg"
      },
      {
        "title": "dummytitle",
        "releaseYear": 1980,
        "director": "spielberg"
      }
    ]
  },
  {
    "name": "Reece14",
    "birth_year": 1973,
    "gender": "f",
    "movies": [
      {
        "title": "dummytitle",
        "releaseYear": 1980,
        "director": "spielberg"
      },
      {
        "title": "dummytitle",
        "releaseYear": 1980,
        "director": "spielberg"
      }
    ]
  },
  {
    "name": "Keanu15",
    "birth_year": 1978,
    "gender": "m",
    "movies": [
      {
        "title": "dummytitle",
        "releaseYear": 1980,
        "director": "spielberg"
      },
      {
        "title": "dummytitle",
        "releaseYear": 1980,
        "director": "spielberg"
      }
    ]
  },
  {
    "name": "Keanu16",
    "birth_year": 1965,
    "gender": "m",
    "movies": [
      {
        "title": "dummytitle",
        "releaseYear": 1980,
        "director": "spielberg"
      },
      {
        "title": "dummytitle",
        "releaseYear": 1980,
        "director": "spielberg"
      }
    ]
  },
  {
    "name": "Keanu17",
    "birth_year": 1945,
    "gender": "m",
    "movies": [
      {
        "title": "dummytitle",
        "releaseYear": 1980,
        "director": "spielberg"
      },
      {
        "title": "dummytitle",
        "releaseYear": 1980,
        "director": "spielberg"
      }
    ]
  },
  {
    "name": "Reece18",
    "birth_year": 1936,
    "gender": "f",
    "movies": [
      {
        "title": "dummytitle",
        "releaseYear": 1980,
        "director": "spielberg"
      },
      {
        "title": "dummytitle",
        "releaseYear": 1980,
        "director": "spielberg"
      }
    ]
  },
  {
    "name": "Reece19",
    "birth_year": 1976,
    "gender": "f",
    "movies": [
      {
        "title": "dummytitle",
        "releaseYear": 1980,
        "director": "spielberg"
      },
      {
        "title": "dummytitle",
        "releaseYear": 1980,
        "director": "spielberg"
      }
    ]
  }
]