[
  {
    "humidity": 58,
    "co": 1988,
    "timestamp": "2023-11-15T10:37:07.727270700"
  },
  {
    "humidity": 35,
    "co": 232,
    "timestamp": "2023-11-15T10:37:07.728495"
  },
  {
    "humidity": 27,
    "co": 253,
    "timestamp": "2023-11-15T10:37:07.728495"
  },
  {
    "humidity": 38,
    "co": 938,
    "timestamp": "2023-11-15T10:37:07.728495"
  },
  {
    "humidity": 56,
    "co": 1956,
    "timestamp": "2023-11-15T10:37:07.728495"
  },
  {
    "humidity": 42,
    "co": 834,
    "timestamp": "2023-11-15T10:37:07.728495"
  },
  {
    "humidity": 43,
    "co": 1161,
    "timestamp": "2023-11-15T10:37:07.728495"
  },
  {
    "humidity": 46,
    "co": 1336,
    "timestamp": "2023-11-15T10:37:07.728495"
  },
  {
    "humidity": 43,
    "co": 1241,
    "timestamp": "2023-11-15T10:37:07.728495"
  },
  {
    "humidity": 45,
    "co": 1450,
    "timestamp": "2023-11-15T10:37:07.728495"
  },
  {
    "humidity": 36,
    "co": 992,
    "timestamp": "2023-11-15T10:37:07.728495"
  },
  {
    "humidity": 50,
    "co": 1307,
    "timestamp": "2023-11-15T10:37:07.728495"
  },
  {
    "humidity": 23,
    "co": 1770,
    "timestamp": "2023-11-15T10:37:07.728495"
  },
  {
    "humidity": 26,
    "co": 562,
    "timestamp": "2023-11-15T10:37:07.728495"
  },
  {
    "humidity": 57,
    "co": 104,
    "timestamp": "2023-11-15T10:37:07.728495"
  },
  {
    "humidity": 20,
    "co": 1322,
    "timestamp": "2023-11-15T10:37:07.728495"
  },
  {
    "humidity": 33,
    "co": 291,
    "timestamp": "2023-11-15T10:37:07.728495"
  },
  {
    "humidity": 58,
    "co": 691,
    "timestamp": "2023-11-15T10:37:07.728495"
  },
  {
    "humidity": 29,
    "co": 861,
    "timestamp": "2023-11-15T10:37:07.728495"
  },
  {
    "humidity": 37,
    "co": 714,
    "timestamp": "2023-11-15T10:37:07.728495"
  },
  {
    "humidity": 31,
    "co": 254,
    "timestamp": "2023-11-15T10:37:07.728495"
  },
  {
    "humidity": 45,
    "co": 1245,
    "timestamp": "2023-11-15T10:37:07.728495"
  },
  {
    "humidity": 52,
    "co": 1082,
    "timestamp": "2023-11-15T10:37:07.728495"
  },
  {
    "humidity": 47,
    "co": 318,
    "timestamp": "2023-11-15T10:37:07.728495"
  }
]