"year","temperature","sun","heat","rain","quality"
1924,3064,1201,10,361,"medium"
1925,3000,1053,11,338,"bad"
1926,3155,1133,19,393,"medium"
1927,3085,970,4,467,"bad"
1928,3245,1258,36,294,"good"
1929,3267,1386,35,225,"good"
1930,3080,966,13,417,"bad"
1931,2974,1189,12,488,"bad"
1932,3038,1103,14,677,"bad"
1933,3318,1310,29,427,"medium"
1934,3317,1362,25,326,"good"
1935,3182,1171,28,326,"bad"
1936,2998,1102,9,349,"bad"
1937,3221,1424,21,382,"good"
1938,3019,1230,16,275,"medium"
1939,3022,1285,9,303,"medium"
1940,3094,1329,11,339,"medium"
1941,3009,1210,15,536,"bad"
1942,3227,1331,21,414,"medium"
1943,3308,1366,24,282,"good"
1944,3212,1289,17,302,"medium"
1945,3361,1444,25,253,"good"
1946,3061,1175,12,261,"medium"
1947,3478,1317,42,259,"good"
1948,3126,1248,11,315,"medium"
1949,3458,1508,43,286,"good"
1950,3252,1361,26,346,"medium"
1951,3052,1186,14,443,"bad"
1952,3270,1399,24,306,"good"
1953,3198,1259,20,367,"good"
1954,2904,1164,6,311,"bad"
1955,3247,1277,19,375,"good"
1956,3083,1195,5,441,"bad"
1957,3043,1208,14,371,"bad"
