Paneel,Opbrengst 7,Opbrengst 8,Opbrengst 9,Opbrengst 10,Opbrengst 11,Opbrengst 12,Opbrengst 13,Opbrengst 14,Opbrengst 15,Opbrengst 16,Opbrengst 17,Opbrengst 18,Opbrengst 19,Opbrengst 20,Opbrengst 21,Opbrengst 22,Orientatie
1,0.50,8.00,62.75,210.00,405.75,607.50,806.00,1010.00,1110.00,1180.00,1200.00,1220.00,1230.00,1240.00,1240.00,1240.00,O
2,0.00,0.00,4.00,17.00,30.75,45.75,65.25,104.00,194.00,316.16,438.75,615.15,676.25,707.25,740.75,740.75,W
3,0.00,0.00,4.25,19.75,31.75,48.50,69.50,139.50,233.00,352.25,477.50,651.50,706.00,729.75,763.25,763.25,W
4,0.25,7.25,61.25,220.50,409.75,613.75,805.25,1010.00,1120.00,1190.00,1210.00,1230.00,1240.00,1250.00,1250.00,1250.00,O
5,0.00,0.00,6.00,17.25,33.75,50.50,72.50,142.25,222.75,338.50,473.25,645.25,692.50,707.75,728.25,728.25,W
6,4.10,7.50,60.00,252.75,403.50,615.25,825.75,1030.00,1140.00,1220.00,1240.00,1260.00,1270.00,1280.00,1290.00,1290.00,Z
7,0.00,3.50,12.00,29.00,39.75,55.75,72.75,99.25,178.00,310.25,433.50,614.75,673.75,699.25,731.75,732.00,W
8,0.00,0.50,55.50,249.25,376.75,608.75,798.75,997.00,1120.00,1190.00,1210.00,1230.00,1240.00,1250.00,1250.00,1250.00,O
9,0.00,3.75,14.25,28.75,42.25,57.75,79.00,153.75,226.00,370.25,486.25,668.00,707.75,728.00,761.50,761.50,W
10,0.75,6.25,58.25,196.00,356.25,595.25,790.50,1000.00,1100.00,1170.00,1200.00,1210.00,1220.00,1230.00,1230.00,1230.00,O
11,0.00,4.25,13.75,35.00,100.25,220.50,388.75,612.75,782.00,980.00,1130.00,1320.00,1420.00,1420.00,1420.00,1420.00,O
12,0.00,3.75,11.50,36.00,104.25,232.25,403.00,637.75,808.25,990.75,1160.00,1340.00,1430.00,1440.00,1440.00,1440.00,Z
13,0.00,4.50,14.25,37.00,102.25,227.00,392.00,614.25,799.25,992.25,1140.00,1330.00,1430.00,1440.00,1440.00,1440.00,Z
14,0.00,4.25,13.25,33.00,95.25,213.25,384.00,598.25,793.25,975.25,1130.00,1330.00,1430.00,1440.00,1440.00,1440.00,Z
15,0.00,0.00,6.00,20.25,31.25,46.00,59.75,124.25,200.00,322.75,427.00,609.00,629.50,641.50,650.75,650.75,W
16,0.00,0.00,0.65,18.50,30.00,42.00,60.70,124.25,209.00,338.50,451.50,614.75,660.50,674.25,699.25,700.25,W
17,0.00,4.75,12.75,39.50,99.50,233.25,407.25,654.25,820.50,1012.00,1170.00,1340.00,1450.00,1450.00,1460.00,1460.00,Z