﻿97.21
94.45
114.56
112.15
83.19
121.64
86.4
91.71
132.74
123.57
99.92
108.45
103.94
113.43
77.88
111.02
104.91
103.14
105.87
91.55
131.94
99.76
87.37
117.78
119.87
118.42
122.61
88.66
107.64
100.4
113.76
109.89
101.05
134.35
88.17
109.89
111.66
95.25
97.99
97.18
96.86
121.32
89.14
90.59
124.05
98.47
81.74
107.96
113.6
97.67
90.1
129.85
128.88
90.43
112.79
102.49
114.08
87.85
99.11
101.69
116.17
135.16
123.57
99.11
98.31
130.01
93.8
84.96
119.55
114.88
101.69
93.00
99.60
121.96
130.01
92.2
100.72
120.84
108.77
125.5
83.99
92.68
98.31
107.64
142.4
107.32
98.47
118.91
127.27
112.95
104.91
98.63
111.83
117.14
92.52
114.88
104.1
126.15
108.77
122.77