Paneel,Opbrengst 8,Opbrengst 9,Opbrengst 10,Opbrengst 11,Opbrengst 12,Opbrengst 13,Opbrengst 14,Opbrengst 15,Opbrengst 16,Opbrengst 17,Opbrengst 18,Opbrengst 19,Opbrengst 20,Opbrengst 21,Opbrengst 22,Orientatie
1,7.5,54.75,147.25,195.75,201.75,198.5,204,100,70,20,20,10,10,0,0,O
2,0,4,13,13.75,15,19.5,38.75,90,122.16,122.59,176.4,61.1,31,33.5,0,W
3,0,4.25,15.5,12,16.75,21,70,93.5,119.25,125.25,174,54.5,23.75,33.5,0,W
4,7,54,159.25,189.25,204,191.5,204.75,110,70,20,20,10,10,0,0,O
5,0,6,11.25,16.5,16.75,22,69.75,80.5,115.75,134.75,172,47.25,15.25,20.5,0,W
6,3.4,52.5,192.75,150.75,211.75,210.5,204.25,110,80,20,20,10,10,10,0,Z
7,3.5,8.5,17,10.75,16,17,26.5,78.75,132.25,123.25,181.25,59,25.5,32.5,0.25,W
8,0.5,55,193.75,127.5,232,190,198.25,123,70,20,20,10,10,0,0,O
9,3.75,10.5,14.5,13.5,15.5,21.25,74.75,72.25,144.25,116,181.75,39.75,20.25,33.5,0,W
10,5.5,52,137.75,160.25,239,195.25,209.5,100,70,30,10,10,10,0,0,O
11,4.25,9.5,21.25,65.25,120.25,168.25,224,169.25,198,150,250,40,0,0,0,O
12,3.75,7.75,24.5,68.25,128,170.75,234.75,170.5,182.5,169.25,180,90,10,0,0,Z
13,4.5,9.75,22.75,65.25,124.75,165,222.25,185,193,147.75,190,100,10,0,0,Z
14,4.25,9,19.75,62.25,118,170.75,214.25,195,182,154.75,200,100,10,0,0,Z
15,0,6,14.25,11,14.75,13.75,64.5,75.75,122.75,104.25,182,20.5,12,9.25,0,W
16,0,0.65,17.85,11.5,12,18.7,63.55,84.75,129.5,113,163.25,45.75,13.75,25,1,W
17,4.75,8,26.75,60,133.75,174,247,166.25,191.5,158,170,110,0,10,0,Z
