10.31903
10.04050
11.09166
12.79149
13.28879
12.31160
13.62450
11.49426
18.86348
14.67206
14.37936
16.51949
23.04511
20.88957
12.91455
11.52702
20.58435
18.83233
24.1172
23.71829
23.6704
16.01594
23.78429
15.14473
33.45386
31.59845
23.70018
29.63701
33.40021
28.43690
22.0999
36.33519
38.12902
18.46850
38.44913
37.56034
21.93710
28.35727
39.45547
41.24649
27.61355
42.41478
33.21405
12.80910
27.06442
39.13556
31.70204
54.22432
31.45624
61.95407
58.96859
17.22669
15.00046
21.16685
33.81828
30.48527
60.53116
67.61716
14.15037
69.75632
63.95019
75.82008
15.25823
24.82173
68.94461
49.28347
36.19588
29.72135
46.37832
40.75394
22.76417
54.5791
53.10161
16.05342
39.0095
29.29550
38.55086
61.01861
71.57244
20.88407
72.79485
40.87587
38.46238
18.24351
48.32092
48.65003
66.81096
78.47464
38.06986
65.55554
80.71152
94.84581
94.15245
70.32107
64.16636
22.86396
61.37139
55.12536
87.28368
84.29416
99.44775
24.88674
52.71558
44.50128
34.18242
47.14788
110.5853
126.8070
98.2171
101.2824
48.37713
76.97278
126.78
59.59084
40.6556
113.9607
36.27758
29.27367
104.9599
120.9712
105.4974
57.91232
46.407
42.4337
98.40797
49.42615
65.36049
106.9526
63.87691
61.72047
123.0440
123.5386
42.68909
94.8619
141.5458
36.72603
130.2288
35.05466
112.9467
105.4086
147.9044
96.56019
76.3157
92.40683
84.90785
89.27026
170.4597
53.41953
100.6708
99.36039
87.4248
128.2193
127.3402
35.70172
123.3507
89.70627
46.67939
117.4085
142.9263
180.2572
107.0587
119.9951
198.8212
138.8757
120.6256
99.5878
92.97964
158.5248
153.0509
199.9873
201.2863
97.00183
158.4840
169.0379
80.38856
72.50466
44.08608
168.6809
136.4244
192.3719
109.2513
88.3839
96.5208
154.2919
118.3621
176.6221
103.3035
114.2348
94.0281
99.0212
98.52318
171.6469
155.0662
134.5239
91.53653
53.98278
54.71326
175.3775
173.8766
68.07101
72.63558
241.3486
186.097
152.2274
162.5922
186.6198
208.1382
178.8265
89.7299
139.9686
114.9767
215.6087
101.5645
123.0632
168.2303
222.4039
88.39447
128.2155
190.6158
67.50742
233.4791
192.0003
72.25682
79.091
118.2031
260.0375
277.1428
76.48997
108.3931
135.7176
162.9785
178.2696
225.7199
210.9025
200.7729
154.5917
81.29927
294.7382
291.6001
237.5041
193.5957
74.80943
141.6468
156.0102
99.58294
299.6416
132.8309
181.6727
252.8500
297.1587
188.8799
74.1199
130.2949
241.3182
295.5895
121.9885
239.1024
126.0818
161.1522
290.351
239.5123
332.6088
341.189
264.1789
226.8961
96.44296
119.0568
340.2949
197.7603
176.3245
121.4501
326.8768
100.5920
199.6226
294.7209
94.61347
283.4577
283.9828
262.4069
155.3445
172.1659
248.6552
146.2114
214.4809
367.2243
199.5732
298.3118
350.4742
267.1189
383.3833
108.3169
268.6583
134.3907
203.5844
131.3348
377.3266
279.4651
241.9554
333.8953
230.0657
378.3256
362.1336
146.9113
195.0742
390.1665
108.8247
183.1618
208.5050
215.1315
312.8023
332.5152
380.9352
347.705
208.9549
380.0837
418.2126
301.3435
383.2852
236.9282
246.4836
144.0285
247.2536
243.2101
365.3399
129.9842
380.8176
351.4174
316.9701
266.5141
129.8577
249.7091
176.5083
181.0108
346.8358
403.7099
242.1098
352.8941
174.8072
264.9053
187.8455
150.7894
129.3187
268.5686
373.7813
419.7038
148.7384
363.505
265.9126
213.1467
228.0311
227.7996
475.0423
448.9122
182.038
212.6325
274.5526
386.2995
187.8544
465.1945
295.5366
153.7863
291.2321
451.3458
442.0519
299.0821
268.9325
246.737
295.7056
253.8718
468.5216
213.8563
510.3481
233.8442
350.3176
427.7281
497.5374
426.9206
527.5403
397.9093
222.3936
506.2993
229.3247
181.1304
419.661
474.6621
472.6772
209.3498
202.206
363.1591
301.0592
380.746
487.1725
448.0071
284.9154
359.7154
330.1257
292.6088
411.6301
424.1478
372.3577
357.7437
558.2288
261.4586
382.1299
381.7132
567.1184
520.0444
434.4922
312.1402
252.7406
181.412
495.4647
260.9344
222.5869
306.665
520.305
480.107
555.0286
341.627
326.7764
343.8341
307.6325
451.5008
551.2634
393.7157
565.4216
262.8047
498.5846
305.1002
550.1015
499.2835
516.5215
495.2133
445.0802
441.1813
432.5164
555.2662
214.3060
220.4606
240.3392
253.1544
645.8425
516.0865
391.4222
294.1495
348.1907
274.391
539.0338
391.7578
229.5462
600.1814
309.1707
606.6004
239.9183
240.3572
482.9793
237.0221
396.0294
421.9832
373.7047
334.2199
514.8531
479.239
630.2734
465.5959
244.454
524.9014
235.2717
552.7331
311.5483
476.8042
582.6084
442.0929
677.3981
454.317
709.966
300.1021
560.845
694.5945
631.6091
417.1111
545.8027
645.2421
452.8416
467.5124
330.9232
646.7922
422.7145
340.4825
728.4692
453.8179
466.6497
421.7394
309.4922
701.8144
404.2193
546.621
586.1033
427.7357
563.7082
604.7683
486.7411
727.374
499.0081
748.3512
723.1789
695.9469
540.3923
776.9102
745.2983
349.5215
485.4288
474.269
696.1921
341.7699
664.2216
645.385
524.6194
723.3372
732.9596
587.1034
609.0337
605.4681
756.543
764.2881
793.9521
329.7906
805.1317
712.0175
412.6897
368.1495
368.4888
557.5602
487.8885
771.4295
470.5964
394.5998
451.4607
324.3438
489.8556
384.6536
305.1922
788.4773
729.151
521.3774
772.668
434.5479
534.8536
710.0024
634.7278
654.2363
620.612
700.2179
575.3622
609.214
354.6977
548.2446
329.8497
773.1624
753.2278
585.3443
346.6711
804.0895
499.127
392.9826
512.1462
897.0317
874.5702
861.0952
520.8183
675.9714
734.778
636.1017
425.6464
666.3777
570.8858
720.6204
547.5411
554.1494
493.2809
858.1147
575.9867
670.0197
401.9886
509.9445
895.8013
689.7578
697.1169
935.0175
547.031
698.2627
425.8175
651.242
886.6953
395.0087
745.9495
565.7636
453.4377
933.318
950.821
379.3876
539.4781
678.1455
740.9478
760.0468
905.652
526.7907
941.0207
928.6206
927.726
743.2107
790.824
521.2803
939.5481
595.6651
415.3067
518.5208
825.888
1002.322
728.0577
398.8397
428.814
610.8918
711.7115
670.2429
529.5194
606.9466
707.4249
795.1784
1000.872
562.2689
551.2631
734.0633
782.9123
550.2431
806.6426
853.7761
964.9685
497.1244
916.122
897.6307
744.3891
797.402
489.8059
488.0508
719.3528
785.9309
855.7265
923.8905
827.9489
725.4945
512.1663
953.0793
1060.558
850.0744
1044.873
728.608
1012.573
835.2961
883.0962
963.1174
468.7108
832.7231
763.3638
1024.291
1013.321
917.5982
713.8174
1111.042
482.7015
887.5787
961.8776
974.3283
972.791
890.6216
993.4159
544.8505
924.9905
581.7688
1060.423
834.3069
948.4447
647.7223
987.01
966.4744
812.2528
892.7673
850.3753
835.4892
553.2607
637.7717
1163.228
623.7035
915.3449
916.306
1171.866
825.9566
504.2359
1125.693
964.3704
856.3471
616.6007
1162.660
1006.627
714.007
1156.178
517.1863
1092.193
928.4703
847.4312
986.6755
728.6707
1140.522
1219.619
1002.639
1104.939
1197.783
1207.459
664.4231
741.3574
866.9028
1172.774
664.2913
963.3608
974.4523
1047.932
593.1628
910.0455
984.2152
1185.684
653.5387
838.1922
762.6531
849.8416
1122.249
792.6311
968.2004
899.0428
1243.659
1013.245
867.8693
1221.236
1235.470
1195.395
850.9293
737.9167
1077.795
644.1465
779.851
690.4684
617.9537
881.0165
1262.748
588.8171
1289.509
1193.719
931.5349
899.7258
1255.529
911.7203
1245.774
799.4366
804.3483
1117.438
779.412
861.0137
841.168
635.3602
920.5499
1240.817
1337.219
989.3783
947.6695
1178.533
813.0854
955.6427
688.3438
849.1047
890.3397
1299.704
1292.546
870.567
1061.175
653.9739
666.2242
1327.593
1351.666
928.7917
975.5034
902.8895
1032.338
694.622
905.2101
1090.872
737.3021
891.7395
962.368
729.7938
705.664
1197.534
929.7851
689.6257
685.6497
800.3074
972.5628
1061.334
1447.99
816.23
744.7974
849.5972
1016.916
1013.779
1235.905
1117.371
1250.056
1044.487
1155.243
1266.617
1370.871
1109.245
909.3418
769.5096
1404.512
1184.453
1291.497
1459.455
1439.583
1405.485
1369.647
1141.427
928.172
844.4908
1241.640
1175.935
1005.75
900.996
1438.153
732.1064
992.0721
798.832
1371.202
1185.803
937.8653
1361.417
1181.620
1059.277
1445.845
1259.350
1032.863
1399.432
1151.23
1479.173
1086.508
762.5872
1528.463
981.7345
1407.989
841.0733
1289.508
1056.017
1005.225
1149.757
895.0845
1570.371
1067.182
1071.874
1313.948
1532.771
1099.474
883.3989
1399.546
865.5895
1241.808
1243.596
1381.872
835.7854
1535.158
1114.624
1537.685
1630.203
1318.728
789.2422
1643.826
1267.777
914.2534
1452.106
1530.63
1656.006
1543.829
1222.907
996.5784
819.9213
927.6788
1478.789
1067.465
1686.306
1669.381
1148.586
1069.348
1605.641
1471.921
1338.770
1705.916
1032.967
1422.167
886.2094
1169.04
1032.854
1684.782
1439.348
1634.802
1584.219
928.1378
1100.248
1631.989
1753.274
988.4986
891.532
1334.962
1467.075
1169.120
1381.439
999.2134
1742.138
1396.268
1359.668
1072.781
1717.648
1257.039
1003.463
1787.084
1631.983
1201.866
1478.122
1693.132
988.3802
1551.038
1739.423
900.3942
927.9498
1102.078
1377.817
1748.388
1771.611
1409.248
1337.156
1585.357
1634.330
1347.107
1512.497
1336.947
1767.364
1327.814
1152.638
1203.408
1313.460
1107.324
1621.343
1152.205
1068.010
1337.682
1153.259
1623.615
1427.263
1466.185
1813.077
1865.855
1790.429
1033.226
1259.566
1762.627
1558.674
1928.781
1887.904
1234.477
1112.410
1383.498
1813.813
1145.657
1620.739
1722.367
1080.645
1021.513
1460.644
1651.01
1487.018
1806.361
1943.524
1329.631
1787.504
1238.582
1245.351
1359.061
1443.600
1858.409
1668.637
1136.496
1217.749
1636.919
1111.082
