module github/epith/302-backend-user

go 1.21.1

require (
	github.com/aarondl/opt v0.0.0-20230313190023-85d93d668fec
	github.com/go-chi/chi/v5 v5.0.10
	github.com/go-chi/render v1.0.3
	github.com/jaswdr/faker v1.19.1
	github.com/lib/pq v1.10.9
	github.com/prometheus/client_golang v1.17.0
	github.com/sirupsen/logrus v1.9.3
	github.com/stephenafamo/bob v0.22.0
)

require (
	github.com/Azure/go-ansiterm v0.0.0-20170929234023-d6e3b3328b78 // indirect
	github.com/Microsoft/go-winio v0.6.0 // indirect
	github.com/Nvveen/Gotty v0.0.0-20120604004816-cd527374f1e5 // indirect
	github.com/beorn7/perks v1.0.1 // indirect
	github.com/cenkalti/backoff/v4 v4.1.3 // indirect
	github.com/cespare/xxhash/v2 v2.2.0 // indirect
	github.com/containerd/continuity v0.3.0 // indirect
	github.com/docker/cli v20.10.17+incompatible // indirect
	github.com/docker/docker v20.10.7+incompatible // indirect
	github.com/docker/go-connections v0.4.0 // indirect
	github.com/docker/go-units v0.4.0 // indirect
	github.com/gogo/protobuf v1.3.2 // indirect
	github.com/golang/protobuf v1.5.3 // indirect
	github.com/google/go-cmp v0.5.9 // indirect
	github.com/google/shlex v0.0.0-20191202100458-e7afc7fbc510 // indirect
	github.com/imdario/mergo v0.3.13 // indirect
	github.com/matttproud/golang_protobuf_extensions v1.0.4 // indirect
	github.com/mitchellh/mapstructure v1.5.0 // indirect
	github.com/moby/term v0.0.0-20201216013528-df9cb8a40635 // indirect
	github.com/opencontainers/go-digest v1.0.0 // indirect
	github.com/opencontainers/image-spec v1.0.2 // indirect
	github.com/opencontainers/runc v1.1.5 // indirect
	github.com/pkg/errors v0.9.1 // indirect
	github.com/prometheus/client_model v0.4.1-0.20230718164431-9a2bf3000d16 // indirect
	github.com/prometheus/common v0.44.0 // indirect
	github.com/prometheus/procfs v0.11.1 // indirect
	github.com/rogpeppe/go-internal v1.11.0 // indirect
	github.com/stretchr/testify v1.8.4 // indirect
	github.com/xeipuuv/gojsonpointer v0.0.0-20180127040702-4e3ac2762d5f // indirect
	github.com/xeipuuv/gojsonreference v0.0.0-20180127040603-bd5ef7bd5415 // indirect
	github.com/xeipuuv/gojsonschema v1.2.0 // indirect
	golang.org/x/mod v0.12.0 // indirect
	golang.org/x/sys v0.13.0 // indirect
	golang.org/x/tools v0.7.0 // indirect
	gopkg.in/yaml.v2 v2.4.0 // indirect
)

require (
	github.com/aarondl/json v0.0.0-20221020222930-8b0db17ef1bf // indirect
	github.com/ajg/form v1.5.1 // indirect
	github.com/go-chi/cors v1.2.1
	github.com/google/uuid v1.3.1 // indirect
	github.com/jackc/pgx/v5 v5.4.3 // indirect
	github.com/ory/dockertest/v3 v3.10.0
	github.com/qdm12/reprint v0.0.0-20200326205758-722754a53494 // indirect
	github.com/stephenafamo/scan v0.4.2 // indirect
	golang.org/x/crypto v0.14.0 // indirect
	golang.org/x/text v0.13.0 // indirect
	google.golang.org/protobuf v1.31.0 // indirect
	gotest.tools/v3 v3.5.1
)
