{
  "name" : "default",
  "dataAdapterId" : "1",
  "type" : "CustomDataAdapter",
  "encryptSecureInfo" : false,
  "config" : {
    "authservicetype" : "IdentityProvider",
    "jdbcClass" : "com.mysql.jdbc.Driver",
    "jdbcUrl" : "jdbc:mysql://credicentro-qa-0caea590-cae3-11eb-883f-000d3a6ecd9a.mysql.database.azure.com:3306?useSSL=true&requireSSL=true&verifyServerCertificate=false",
    "userId" : "dbclient@credicentro-qa-0caea590-cae3-11eb-883f-000d3a6ecd9a",
    "password" : "Cr3dI@C3ntRo",
    "advancedSettings" : null,
    "maxPoolSize" : null,
    "connectionTimeout" : null
  },
  "jsonpath" : false
}