{
  "operationConfig" : {
    "name" : "shortTermDeposit8562",
    "type" : "MappedToBackend",
    "cachable" : false,
    "smsEnabled" : false,
    "security" : "authorized_app_user",
    "responseEncoding" : "UTF-8",
    "httpMethod" : "GET",
    "decodeResponseBody" : false,
    "iMapping" : "<?xml version=\"1.0\" encoding=\"UTF-8\" standalone=\"yes\"?><mapper xmlns=\"http://www.kony.com/ns/mapper\"><map inputpath=\"request_in\" outputpath=\"request_out\"><set-param inputpath=\"lastName\" outputpath=\"lastName\"/><set-param inputpath=\"amount\" outputpath=\"amount\"/><set-param inputpath=\"address\" outputpath=\"address\"/><set-param inputpath=\"productId\" outputpath=\"productId\"/><set-param inputpath=\"accountType\" outputpath=\"accountType\"/><set-param inputpath=\"stateId\" outputpath=\"stateId\"/><set-param inputpath=\"payoutAccount\" outputpath=\"payoutAccount\"/><set-param inputpath=\"dateOfBirth\" outputpath=\"dateOfBirth\"/><set-param inputpath=\"Ssn\" outputpath=\"ssn\"/><set-param inputpath=\"duration\" outputpath=\"duration\"/><set-param inputpath=\"firstName\" outputpath=\"firstName\"/><set-param inputpath=\"payingAccount\" outputpath=\"payingAccount\"/></map></mapper>",
    "applyCommonMapping" : true,
    "applyRequestCommonMapping" : true,
    "applyResponseCommonMapping" : true,
    "backendMeta" : {
      "serviceName" : "dbpDBX",
      "serviceVersion" : "1.0",
      "operationName" : "shortTermDeposit"
    },
    "relationshipHierarchyMapping" : {
      "children" : [ ],
      "name" : "Accounts",
      "actions" : { },
      "selected" : true
    },
    "requestXmlMappingOverride" : false,
    "responseXmlMappingOverride" : false
  }
}