{
  "customCode" : {
    "responseProcessorName" : "com.kony.postprocessors.GetUserDetailsPostProcessor"
  },
  "operationConfig" : {
    "name" : "GetUserDetailsConcurrent8350",
    "type" : "MappedToBackend",
    "cachable" : false,
    "smsEnabled" : false,
    "security" : "authorized_app_user",
    "responseEncoding" : "UTF-8",
    "httpMethod" : "GET",
    "decodeResponseBody" : false,
    "odata" : [ {
      "id" : "$select",
      "dataType" : "string",
      "encode" : true,
      "accessType" : "readonly"
    }, {
      "id" : "$filter",
      "dataType" : "string",
      "encode" : true,
      "accessType" : "readonly"
    }, {
      "id" : "$orderby",
      "dataType" : "string",
      "encode" : true,
      "accessType" : "readonly"
    }, {
      "id" : "$top",
      "dataType" : "string",
      "encode" : true,
      "accessType" : "readonly"
    }, {
      "id" : "$skip",
      "dataType" : "string",
      "encode" : true,
      "accessType" : "readonly"
    }, {
      "id" : "$expand",
      "dataType" : "string",
      "encode" : true,
      "accessType" : "readonly"
    }, {
      "id" : "$batchsize",
      "dataType" : "string",
      "encode" : true,
      "accessType" : "readonly"
    }, {
      "id" : "$batchid",
      "dataType" : "string",
      "encode" : true,
      "accessType" : "readonly"
    } ],
    "iMapping" : "<?xml version=\"1.0\" encoding=\"UTF-8\" standalone=\"yes\"?><mapper xmlns=\"http://www.kony.com/ns/mapper\">  <map inputpath=\"request_in\" outputpath=\"request_out\">    <set-param inputpath=\"password\" outputpath=\"password\"/>    <set-param inputpath=\"accountType\" outputpath=\"accountType\"/>    <set-param inputpath=\"oldpassword\" outputpath=\"oldpassword\"/>    <set-param inputpath=\"accountNumber\" outputpath=\"accountNumber\"/>    <set-param inputpath=\"partyID\" outputpath=\"partyID\"/>    <set-param inputpath=\"coreCustomerID\" outputpath=\"coreCustomerID\"/>  </map></mapper>",
    "oMapping" : "<?xml version=\"1.0\" encoding=\"UTF-8\" standalone=\"yes\"?><mapper xmlns=\"http://www.kony.com/ns/mapper\">                                                    <map inputpath=\"response_in\" outputpath=\"response_out\">                                                                                                        <map inputpath=\"customer\" outputpath=\"User\">                                                                                                                                                            <set-param inputpath=\"addressLine1\" outputpath=\"addressLine1\"/>                                                                                                                                           <set-param inputpath=\"addressLine2\" outputpath=\"addressLine2\"/>                                                                                          <set-param inputpath=\"areUserAlertsTurnedOn\" outputpath=\"alertsTurnedOn\"/>                                                                                          <set-param inputpath=\"areAccountStatementTermsAccepted\" outputpath=\"areAccountStatementTermsAccepted\"/>                                                                                          <set-param inputpath=\"areDepositTermsAccepted\" outputpath=\"areDepositTermsAccepted\"/>                                                                                          <set-param inputpath=\"bankName\" outputpath=\"bankName\"/>                                                                                          <set-param inputpath=\"cityName\" outputpath=\"city\"/>                                                                                                                                                           <set-param inputpath=\"CountryCode\" outputpath=\"country\"/>                                                                                          <set-param inputpath=\"currencyCode\" outputpath=\"currencyCode\"/>                                                                                                   <set-param inputpath=\"DateOfBirth\" outputpath=\"dateOfBirth\"/>                                                                                             <set-param inputpath=\"DateOfBirth\" outputpath=\"DateOfBirth\"/>                                                                                    <set-param inputpath=\"default_account_billPay\" outputpath=\"default_account_billPay\"/>                                                                                               <set-param inputpath=\"default_account_cardless\" outputpath=\"default_account_cardless\"/>                                                                                          <set-param inputpath=\"default_account_deposit\" outputpath=\"default_account_deposit\"/>                                                                                          <set-param inputpath=\"default_account_payments\" outputpath=\"default_account_payments\"/>                                                                                          <set-param inputpath=\"default_account_transfers\" outputpath=\"default_account_transfers\"/>                                                                                          <set-param inputpath=\"default_from_account_p2p\" outputpath=\"default_from_account_p2p\"/>                                                                                          <set-param inputpath=\"default_to_account_p2p\" outputpath=\"default_to_account_p2p\"/>                                                                                          <set-param inputpath=\"email\" outputpath=\"email\"/>                                                                                                                                                            <set-param inputpath=\"IsPinSet\" outputpath=\"isPinSet\"/>                                                                                          <set-param inputpath=\"Lastlogintime\" outputpath=\"lastlogintime\"/>                                                                                                     <set-param inputpath=\"phone\" outputpath=\"phone\"/>                                                                                                                  <set-param inputpath=\"phoneExtension\" outputpath=\"phoneExtension\"/>                                                                                                                         <set-param inputpath=\"phoneCountryCode\" outputpath=\"phoneCountryCode\"/>                                                                                                                         <set-param inputpath=\"role\" outputpath=\"role\"/>                                                                                                                                                            <set-param inputpath=\"secondaryemail\" outputpath=\"secondaryemail\"/>                                                                                           <set-param inputpath=\"secondaryemail2\" outputpath=\"secondaryemail2\"/>                                                                                          <set-param inputpath=\"secondaryphone\" outputpath=\"secondaryphone\"/>                                                                                          <set-param inputpath=\"secondaryphone2\" outputpath=\"secondaryphone2\"/>                                                                                          <set-param inputpath=\"Ssn\" outputpath=\"ssn\"/>                                                                                    <set-param inputpath=\"Ssn\" outputpath=\"Ssn\"/>                                                                                    <set-param inputpath=\"state\" outputpath=\"state\"/>                                                                                                                                                            <set-param inputpath=\"FirstName\" outputpath=\"userfirstname\"/>                                                                                          <set-param inputpath=\"id\" outputpath=\"userId\"/>                                                                                                                                                            <set-param inputpath=\"UserImage\" outputpath=\"userImage\"/>                                                                                           <set-param inputpath=\"LastName\" outputpath=\"userlastname\"/>                                                                                                   <set-param inputpath=\"LastName\" outputpath=\"LastName\"/>                                                                                    <set-param inputpath=\"UserName\" outputpath=\"userName\"/>                                                                                             <set-param inputpath=\"zipCode\" outputpath=\"zipcode\"/>                                                                                                     <set-param inputpath=\"default_account_wire\" outputpath=\"default_account_wire\"/>                                                                                                       <set-param inputpath=\"isWireTransferActivated\" outputpath=\"isWireTransferActivated\"/>                                                                                          <set-param inputpath=\"isWireTransferEligible\" outputpath=\"isWireTransferEligible\"/>                                                                                          <set-param inputpath=\"UserImageURL\" outputpath=\"userImageURL\"/>     \t                                                                                                                                <set-param inputpath=\"MaritalStatus_id\" outputpath=\"maritalStatus\"/>                                                                                                                                    <set-param inputpath=\"NoOfDependents\" outputpath=\"noOfDependents\"/>                                                                                                                                    <set-param inputpath=\"SpouseName\" outputpath=\"spouseFirstName\"/>                                                                                                                                    <set-param inputpath=\"spouselastname\" outputpath=\"spouseLastName\"/>                                                                                                                                    <set-param inputpath=\"Gender\" outputpath=\"gender\"/>                                                                                                                                    <set-param inputpath=\"showBillPayFromAccPopup\" outputpath=\"showBillPayFromAccPopup\"/>                                                                                          <set-param inputpath=\"isP2PActivated\" outputpath=\"isP2PActivated\"/>                                                                                                                                    <set-param inputpath=\"isP2PSupported\" outputpath=\"isP2PSupported\"/>                                                                                                                                    <set-param inputpath=\"isBillPaySupported\" outputpath=\"isBillPaySupported\"/>                                                                                                                                    <set-param inputpath=\"isBillPayActivated\" outputpath=\"isBillPayActivated\"/>                                                                                                  <set-param inputpath=\"feedbackUserId\" outputpath=\"feedbackUserId\"/>                                                                                    <set-param inputpath=\"isVIPCustomer\" outputpath=\"isVIPCustomer\"/>                                                            <set-param inputpath=\"PreferredTimeAndMethod\" outputpath=\"PreferredTimeAndMethod\"/>                                                            <set-param inputpath=\"PreferredContactMethod\" outputpath=\"PreferredContactMethod\"/>                                                            <set-param inputpath=\"PreferredContactTime\" outputpath=\"PreferredContactTime\"/>                                                            <set-param inputpath=\"isSecurityQuestionConfigured\" outputpath=\"isSecurityQuestionConfigured\"/>                                          <set-param inputpath=\"isActivationLinkSent\" outputpath=\"isActivationLinkSent\"/>                                          <set-param inputpath=\"customerStatus\" outputpath=\"customerStatus\"/>                                          <set-param inputpath=\"isCustomerEnrolled\" outputpath=\"isCustomerEnrolled\"/>            <set-param inputpath=\"isAssociated\" outputpath=\"isAssociated\"/>            <map inputpath=\"Addresses\" outputpath=\"Addresses\">                                                                                                                           <set-param inputpath=\"Address_id\" outputpath=\"Address_id\"/>                                                                                                                           <set-param inputpath=\"AddressType\" outputpath=\"AddressType\"/>                                                                                                                          <set-param inputpath=\"AddressLine1\" outputpath=\"AddressLine1\"/>                                                                                                                          <set-param inputpath=\"AddressLine2\" outputpath=\"AddressLine2\"/>                                                                                                                          <set-param inputpath=\"ZipCode\" outputpath=\"ZipCode\"/>                                                                                                                          <set-param inputpath=\"addressType\" outputpath=\"AddressType\"/>                                                                                                                                                                <set-param inputpath=\"addressLine1\" outputpath=\"AddressLine1\"/>                                                                                                                                                                <set-param inputpath=\"addressLine2\" outputpath=\"AddressLine2\"/>                                                                                                                                                                <set-param inputpath=\"zipcode\" outputpath=\"ZipCode\"/>\t                        <set-param inputpath=\"CityName\" outputpath=\"CityName\"/>                                                                                                                          <set-param inputpath=\"addressCity\" outputpath=\"CityName\"/>                                                                                                <set-param inputpath=\"City_id\" outputpath=\"City_id\"/>                                                                                                                          <set-param inputpath=\"RegionName\" outputpath=\"RegionName\"/>                                                                                                                          <set-param inputpath=\"Region_id\" outputpath=\"Region_id\"/>                                                                                                                          <set-param inputpath=\"RegionCode\" outputpath=\"RegionCode\"/>                                                                                                                          <set-param inputpath=\"CountryName\" outputpath=\"CountryName\"/>                                                                                                                          <set-param inputpath=\"Country_id\" outputpath=\"Country_id\"/>                                                                                                                          <set-param inputpath=\"CountryCode\" outputpath=\"CountryCode\"/>                                                                                                                          <set-param inputpath=\"isPrimary\" outputpath=\"isPrimary\"/>                                                                                                         <set-param inputpath=\"isTypeBusiness\" outputpath=\"isTypeBusiness\"/>                                                      </map>                                                                                   <map inputpath=\"ContactNumbers\" outputpath=\"ContactNumbers\">                                                                                                                           <set-param inputpath=\"id\" outputpath=\"id\"/>                                                                                                                           <set-param inputpath=\"Type_id\" outputpath=\"Type_id\"/>                                                                                                                          <set-param inputpath=\"isPrimary\" outputpath=\"isPrimary\"/>                                                                                                                          <set-param inputpath=\"Value\" outputpath=\"Value\"/>                                                                                                                          <set-param inputpath=\"Extension\" outputpath=\"Extension\"/>                                                                                                                          <set-param inputpath=\"Description\" outputpath=\"Description\"/>                                                                                          <set-param inputpath=\"phoneCountryCode\" outputpath=\"phoneCountryCode\"/>                                                                                          <set-param inputpath=\"phoneNumber\" outputpath=\"phoneNumber\"/>                                                                                         <set-param inputpath=\"phoneExtension\" outputpath=\"phoneExtension\"/>                                                                        <set-param inputpath=\"isTypeBusiness\" outputpath=\"isTypeBusiness\"/>                                                                 <set-param inputpath=\"isAlertsRequired\" outputpath=\"isAlertsRequired\"/>                                                 </map>                                                                                  <map inputpath=\"EmailIds\" outputpath=\"EmailIds\">                                                                                                                           <set-param inputpath=\"id\" outputpath=\"id\"/>                                                                                                                           <set-param inputpath=\"Type_id\" outputpath=\"Type_id\"/>                                                                                                                          <set-param inputpath=\"isPrimary\" outputpath=\"isPrimary\"/>                                                                                                                          <set-param inputpath=\"Value\" outputpath=\"Value\"/>                                                                                                                          <set-param inputpath=\"Extension\" outputpath=\"Extension\"/>                                                                                                                          <set-param inputpath=\"Description\" outputpath=\"Description\"/>                                                                        <set-param inputpath=\"isTypeBusiness\" outputpath=\"isTypeBusiness\"/>                                                                    <set-param inputpath=\"isAlertsRequired\" outputpath=\"isAlertsRequired\"/>                                                 </map>                                     <map inputpath=\"customers\" outputpath=\"CoreCustomers\">                                                                                                                           <set-param inputpath=\"coreCustomerId\" outputpath=\"coreCustomerID\"/>                                                                                                                           <set-param inputpath=\"coreCustomerName\" outputpath=\"coreCustomerName\"/>                                                                                                                          <set-param inputpath=\"isBusiness\" outputpath=\"isBusiness\"/>                                                                                                                          <set-param inputpath=\"isPrimary\" outputpath=\"isPrimary\"/>                                                                                                                          <set-param inputpath=\"contractId\" outputpath=\"contractId\"/>                            <set-param inputpath=\"contractName\" outputpath=\"contractName\"/>                   </map>                         </map>                                                    </map></mapper>",
    "iVisualMappingData" : "{\"nodeDataArray\":[{\"isGroup\":true,\"key\":\"request_in\",\"text\":\"User\",\"xy\":\"150 100\"},{\"isGroup\":true,\"key\":\"request_out\",\"text\":\"dbpProductServices (1.0).GetUserDetailsConcurrent\",\"xy\":\"770 100\"}],\"linkDataArray\":[{\"from\":\"source\",\"to\":\"source:User\",\"fromPort\":\"source\",\"toPort\":\"source:User\",\"visible\":true,\"common\":false},{\"from\":\"source:User\",\"to\":\"source:User:fields\",\"fromPort\":\"source:User\",\"toPort\":\"source:User:fields\",\"visible\":true,\"common\":false},{\"from\":\"source:User:fields\",\"to\":\"source:User:accountNumber:\",\"fromPort\":\"source:User:fields\",\"toPort\":\"source:User:accountNumber:\",\"visible\":true,\"common\":false},{\"from\":\"source:User:fields\",\"to\":\"source:User:accountType:\",\"fromPort\":\"source:User:fields\",\"toPort\":\"source:User:accountType:\",\"visible\":true,\"common\":false},{\"from\":\"source:User:fields\",\"to\":\"source:User:addressId:\",\"fromPort\":\"source:User:fields\",\"toPort\":\"source:User:addressId:\",\"visible\":true,\"common\":false},{\"from\":\"source:User:fields\",\"to\":\"source:User:addressLine1:\",\"fromPort\":\"source:User:fields\",\"toPort\":\"source:User:addressLine1:\",\"visible\":true,\"common\":false},{\"from\":\"source:User:fields\",\"to\":\"source:User:addressLine2:\",\"fromPort\":\"source:User:fields\",\"toPort\":\"source:User:addressLine2:\",\"visible\":true,\"common\":false},{\"from\":\"source:User:fields\",\"to\":\"source:User:addressType:\",\"fromPort\":\"source:User:fields\",\"toPort\":\"source:User:addressType:\",\"visible\":true,\"common\":false},{\"from\":\"source:User:fields\",\"to\":\"source:User:alertsTurnedOn:\",\"fromPort\":\"source:User:fields\",\"toPort\":\"source:User:alertsTurnedOn:\",\"visible\":true,\"common\":false},{\"from\":\"source:User:fields\",\"to\":\"source:User:areAccountStatementTermsAccepted:\",\"fromPort\":\"source:User:fields\",\"toPort\":\"source:User:areAccountStatementTermsAccepted:\",\"visible\":true,\"common\":false},{\"from\":\"source:User:fields\",\"to\":\"source:User:areDepositTermsAccepted:\",\"fromPort\":\"source:User:fields\",\"toPort\":\"source:User:areDepositTermsAccepted:\",\"visible\":true,\"common\":false},{\"from\":\"source:User:fields\",\"to\":\"source:User:bankName:\",\"fromPort\":\"source:User:fields\",\"toPort\":\"source:User:bankName:\",\"visible\":true,\"common\":false},{\"from\":\"source:User:fields\",\"to\":\"source:User:cardNumber:\",\"fromPort\":\"source:User:fields\",\"toPort\":\"source:User:cardNumber:\",\"visible\":true,\"common\":false},{\"from\":\"source:User:fields\",\"to\":\"source:User:city:\",\"fromPort\":\"source:User:fields\",\"toPort\":\"source:User:city:\",\"visible\":true,\"common\":false},{\"from\":\"source:User:fields\",\"to\":\"source:User:country:\",\"fromPort\":\"source:User:fields\",\"toPort\":\"source:User:country:\",\"visible\":true,\"common\":false},{\"from\":\"source:User:fields\",\"to\":\"source:User:currencyCode:\",\"fromPort\":\"source:User:fields\",\"toPort\":\"source:User:currencyCode:\",\"visible\":true,\"common\":false},{\"from\":\"source:User:fields\",\"to\":\"source:User:cvv:\",\"fromPort\":\"source:User:fields\",\"toPort\":\"source:User:cvv:\",\"visible\":true,\"common\":false},{\"from\":\"source:User:fields\",\"to\":\"source:User:dateOfBirth:\",\"fromPort\":\"source:User:fields\",\"toPort\":\"source:User:dateOfBirth:\",\"visible\":true,\"common\":false},{\"from\":\"source:User:fields\",\"to\":\"source:User:default_account_billPay:\",\"fromPort\":\"source:User:fields\",\"toPort\":\"source:User:default_account_billPay:\",\"visible\":true,\"common\":false},{\"from\":\"source:User:fields\",\"to\":\"source:User:default_account_cardless:\",\"fromPort\":\"source:User:fields\",\"toPort\":\"source:User:default_account_cardless:\",\"visible\":true,\"common\":false},{\"from\":\"source:User:fields\",\"to\":\"source:User:default_account_deposit:\",\"fromPort\":\"source:User:fields\",\"toPort\":\"source:User:default_account_deposit:\",\"visible\":true,\"common\":false},{\"from\":\"source:User:fields\",\"to\":\"source:User:default_account_payments:\",\"fromPort\":\"source:User:fields\",\"toPort\":\"source:User:default_account_payments:\",\"visible\":true,\"common\":false},{\"from\":\"source:User:fields\",\"to\":\"source:User:default_account_transfers:\",\"fromPort\":\"source:User:fields\",\"toPort\":\"source:User:default_account_transfers:\",\"visible\":true,\"common\":false},{\"from\":\"source:User:fields\",\"to\":\"source:User:default_from_account_p2p:\",\"fromPort\":\"source:User:fields\",\"toPort\":\"source:User:default_from_account_p2p:\",\"visible\":true,\"common\":false},{\"from\":\"source:User:fields\",\"to\":\"source:User:default_to_account_p2p:\",\"fromPort\":\"source:User:fields\",\"toPort\":\"source:User:default_to_account_p2p:\",\"visible\":true,\"common\":false},{\"from\":\"source:User:fields\",\"to\":\"source:User:email:\",\"fromPort\":\"source:User:fields\",\"toPort\":\"source:User:email:\",\"visible\":true,\"common\":false},{\"from\":\"source:User:fields\",\"to\":\"source:User:errmsg:\",\"fromPort\":\"source:User:fields\",\"toPort\":\"source:User:errmsg:\",\"visible\":true,\"common\":false},{\"from\":\"source:User:fields\",\"to\":\"source:User:isEmailEnabled:\",\"fromPort\":\"source:User:fields\",\"toPort\":\"source:User:isEmailEnabled:\",\"visible\":true,\"common\":false},{\"from\":\"source:User:fields\",\"to\":\"source:User:isPhoneEnabled:\",\"fromPort\":\"source:User:fields\",\"toPort\":\"source:User:isPhoneEnabled:\",\"visible\":true,\"common\":false},{\"from\":\"source:User:fields\",\"to\":\"source:User:isPinSet:\",\"fromPort\":\"source:User:fields\",\"toPort\":\"source:User:isPinSet:\",\"visible\":true,\"common\":false},{\"from\":\"source:User:fields\",\"to\":\"source:User:isPreferredAddress:\",\"fromPort\":\"source:User:fields\",\"toPort\":\"source:User:isPreferredAddress:\",\"visible\":true,\"common\":false},{\"from\":\"source:User:fields\",\"to\":\"source:User:lastlogintime:\",\"fromPort\":\"source:User:fields\",\"toPort\":\"source:User:lastlogintime:\",\"visible\":true,\"common\":false},{\"from\":\"source:User:fields\",\"to\":\"source:User:oldpassword:\",\"fromPort\":\"source:User:fields\",\"toPort\":\"source:User:oldpassword:\",\"visible\":true,\"common\":false},{\"from\":\"source:User:fields\",\"to\":\"source:User:otp:\",\"fromPort\":\"source:User:fields\",\"toPort\":\"source:User:otp:\",\"visible\":true,\"common\":false},{\"from\":\"source:User:fields\",\"to\":\"source:User:password:\",\"fromPort\":\"source:User:fields\",\"toPort\":\"source:User:password:\",\"visible\":true,\"common\":false},{\"from\":\"source:User:fields\",\"to\":\"source:User:phone:\",\"fromPort\":\"source:User:fields\",\"toPort\":\"source:User:phone:\",\"visible\":true,\"common\":false},{\"from\":\"source:User:fields\",\"to\":\"source:User:pin:\",\"fromPort\":\"source:User:fields\",\"toPort\":\"source:User:pin:\",\"visible\":true,\"common\":false},{\"from\":\"source:User:fields\",\"to\":\"source:User:result:\",\"fromPort\":\"source:User:fields\",\"toPort\":\"source:User:result:\",\"visible\":true,\"common\":false},{\"from\":\"source:User:fields\",\"to\":\"source:User:role:\",\"fromPort\":\"source:User:fields\",\"toPort\":\"source:User:role:\",\"visible\":true,\"common\":false},{\"from\":\"source:User:fields\",\"to\":\"source:User:secondaryemail:\",\"fromPort\":\"source:User:fields\",\"toPort\":\"source:User:secondaryemail:\",\"visible\":true,\"common\":false},{\"from\":\"source:User:fields\",\"to\":\"source:User:secondaryemail2:\",\"fromPort\":\"source:User:fields\",\"toPort\":\"source:User:secondaryemail2:\",\"visible\":true,\"common\":false},{\"from\":\"source:User:fields\",\"to\":\"source:User:secondaryphone:\",\"fromPort\":\"source:User:fields\",\"toPort\":\"source:User:secondaryphone:\",\"visible\":true,\"common\":false},{\"from\":\"source:User:fields\",\"to\":\"source:User:secondaryphone2:\",\"fromPort\":\"source:User:fields\",\"toPort\":\"source:User:secondaryphone2:\",\"visible\":true,\"common\":false},{\"from\":\"source:User:fields\",\"to\":\"source:User:ssn:\",\"fromPort\":\"source:User:fields\",\"toPort\":\"source:User:ssn:\",\"visible\":true,\"common\":false},{\"from\":\"source:User:fields\",\"to\":\"source:User:state:\",\"fromPort\":\"source:User:fields\",\"toPort\":\"source:User:state:\",\"visible\":true,\"common\":false},{\"from\":\"source:User:fields\",\"to\":\"source:User:success:\",\"fromPort\":\"source:User:fields\",\"toPort\":\"source:User:success:\",\"visible\":true,\"common\":false},{\"from\":\"source:User:fields\",\"to\":\"source:User:userfirstname:\",\"fromPort\":\"source:User:fields\",\"toPort\":\"source:User:userfirstname:\",\"visible\":true,\"common\":false},{\"from\":\"source:User:fields\",\"to\":\"source:User:userId:\",\"fromPort\":\"source:User:fields\",\"toPort\":\"source:User:userId:\",\"visible\":true,\"common\":false},{\"from\":\"source:User:fields\",\"to\":\"source:User:userImage:\",\"fromPort\":\"source:User:fields\",\"toPort\":\"source:User:userImage:\",\"visible\":true,\"common\":false},{\"from\":\"source:User:fields\",\"to\":\"source:User:LastName:\",\"fromPort\":\"source:User:fields\",\"toPort\":\"source:User:LastName:\",\"visible\":true,\"common\":false},{\"from\":\"source:User:fields\",\"to\":\"source:User:userName:\",\"fromPort\":\"source:User:fields\",\"toPort\":\"source:User:userName:\",\"visible\":true,\"common\":false},{\"from\":\"source:User:fields\",\"to\":\"source:User:zipcode:\",\"fromPort\":\"source:User:fields\",\"toPort\":\"source:User:zipcode:\",\"visible\":true,\"common\":false},{\"from\":\"source:User:fields\",\"to\":\"source:User:rating:\",\"fromPort\":\"source:User:fields\",\"toPort\":\"source:User:rating:\",\"visible\":true,\"common\":false},{\"from\":\"source:User:fields\",\"to\":\"source:User:featureRequest:\",\"fromPort\":\"source:User:fields\",\"toPort\":\"source:User:featureRequest:\",\"visible\":true,\"common\":false},{\"from\":\"source:User:fields\",\"to\":\"source:User:description:\",\"fromPort\":\"source:User:fields\",\"toPort\":\"source:User:description:\",\"visible\":true,\"common\":false},{\"from\":\"source:User:fields\",\"to\":\"source:User:default_account_wire:\",\"fromPort\":\"source:User:fields\",\"toPort\":\"source:User:default_account_wire:\",\"visible\":true,\"common\":false},{\"from\":\"source:User:fields\",\"to\":\"source:User:isWireTransferActivated:\",\"fromPort\":\"source:User:fields\",\"toPort\":\"source:User:isWireTransferActivated:\",\"visible\":true,\"common\":false},{\"from\":\"source:User:fields\",\"to\":\"source:User:isWireTransferEligible:\",\"fromPort\":\"source:User:fields\",\"toPort\":\"source:User:isWireTransferEligible:\",\"visible\":true,\"common\":false},{\"from\":\"source:User:fields\",\"to\":\"source:User:userImageURL:\",\"fromPort\":\"source:User:fields\",\"toPort\":\"source:User:userImageURL:\",\"visible\":true,\"common\":false},{\"from\":\"source:User:fields\",\"to\":\"source:User:modifiedByName:\",\"fromPort\":\"source:User:fields\",\"toPort\":\"source:User:modifiedByName:\",\"visible\":true,\"common\":false},{\"from\":\"source:User:fields\",\"to\":\"source:User:Addresses:\",\"fromPort\":\"source:User:fields\",\"toPort\":\"source:User:Addresses:\",\"visible\":true,\"common\":false},{\"from\":\"source:User:fields\",\"to\":\"source:User:phoneNumbers:\",\"fromPort\":\"source:User:fields\",\"toPort\":\"source:User:phoneNumbers:\",\"visible\":true,\"common\":false},{\"from\":\"source:User:fields\",\"to\":\"source:User:preferredContactMethod:\",\"fromPort\":\"source:User:fields\",\"toPort\":\"source:User:preferredContactMethod:\",\"visible\":true,\"common\":false},{\"from\":\"source:User:fields\",\"to\":\"source:User:preferredContactTime:\",\"fromPort\":\"source:User:fields\",\"toPort\":\"source:User:preferredContactTime:\",\"visible\":true,\"common\":false},{\"from\":\"source:User:fields\",\"to\":\"source:User:deleteAddressID:\",\"fromPort\":\"source:User:fields\",\"toPort\":\"source:User:deleteAddressID:\",\"visible\":true,\"common\":false},{\"from\":\"source:User:fields\",\"to\":\"source:User:deleteCommunicationID:\",\"fromPort\":\"source:User:fields\",\"toPort\":\"source:User:deleteCommunicationID:\",\"visible\":true,\"common\":false},{\"from\":\"source:User:fields\",\"to\":\"source:User:maritalStatus:\",\"fromPort\":\"source:User:fields\",\"toPort\":\"source:User:maritalStatus:\",\"visible\":true,\"common\":false},{\"from\":\"source:User:fields\",\"to\":\"source:User:noOfDependents:\",\"fromPort\":\"source:User:fields\",\"toPort\":\"source:User:noOfDependents:\",\"visible\":true,\"common\":false},{\"from\":\"source:User:fields\",\"to\":\"source:User:spouseFirstName:\",\"fromPort\":\"source:User:fields\",\"toPort\":\"source:User:spouseFirstName:\",\"visible\":true,\"common\":false},{\"from\":\"source:User:fields\",\"to\":\"source:User:spouseLastName:\",\"fromPort\":\"source:User:fields\",\"toPort\":\"source:User:spouseLastName:\",\"visible\":true,\"common\":false},{\"from\":\"source:User:fields\",\"to\":\"source:User:gender:\",\"fromPort\":\"source:User:fields\",\"toPort\":\"source:User:gender:\",\"visible\":true,\"common\":false},{\"from\":\"source:User:fields\",\"to\":\"source:User:showBillPayFromAccPopup:\",\"fromPort\":\"source:User:fields\",\"toPort\":\"source:User:showBillPayFromAccPopup:\",\"visible\":true,\"common\":false},{\"from\":\"source:User:fields\",\"to\":\"source:User:isP2PActivated:\",\"fromPort\":\"source:User:fields\",\"toPort\":\"source:User:isP2PActivated:\",\"visible\":true,\"common\":false},{\"from\":\"source:User:fields\",\"to\":\"source:User:isP2PSupported:\",\"fromPort\":\"source:User:fields\",\"toPort\":\"source:User:isP2PSupported:\",\"visible\":true,\"common\":false},{\"from\":\"source:User:fields\",\"to\":\"source:User:isBillPaySupported:\",\"fromPort\":\"source:User:fields\",\"toPort\":\"source:User:isBillPaySupported:\",\"visible\":true,\"common\":false},{\"from\":\"source:User:fields\",\"to\":\"source:User:isBillPayActivated:\",\"fromPort\":\"source:User:fields\",\"toPort\":\"source:User:isBillPayActivated:\",\"visible\":true,\"common\":false},{\"from\":\"source:User:fields\",\"to\":\"source:User:securityKey:\",\"fromPort\":\"source:User:fields\",\"toPort\":\"source:User:securityKey:\",\"visible\":true,\"common\":false},{\"from\":\"source:User:fields\",\"to\":\"source:User:phoneExtension:\",\"fromPort\":\"source:User:fields\",\"toPort\":\"source:User:phoneExtension:\",\"visible\":true,\"common\":false},{\"from\":\"source:User:fields\",\"to\":\"source:User:phoneCountryCode:\",\"fromPort\":\"source:User:fields\",\"toPort\":\"source:User:phoneCountryCode:\",\"visible\":true,\"common\":false},{\"from\":\"source:User:fields\",\"to\":\"source:User:idmConfig:\",\"fromPort\":\"source:User:fields\",\"toPort\":\"source:User:idmConfig:\",\"visible\":true,\"common\":false},{\"from\":\"source:User:fields\",\"to\":\"source:User:errCode:\",\"fromPort\":\"source:User:fields\",\"toPort\":\"source:User:errCode:\",\"visible\":true,\"common\":false},{\"from\":\"source:User:fields\",\"to\":\"source:User:errorMessage:\",\"fromPort\":\"source:User:fields\",\"toPort\":\"source:User:errorMessage:\",\"visible\":true,\"common\":false},{\"from\":\"source:User:fields\",\"to\":\"source:User:errorCode:\",\"fromPort\":\"source:User:fields\",\"toPort\":\"source:User:errorCode:\",\"visible\":true,\"common\":false},{\"from\":\"source:User:fields\",\"to\":\"source:User:Id:\",\"fromPort\":\"source:User:fields\",\"toPort\":\"source:User:Id:\",\"visible\":true,\"common\":false},{\"from\":\"source:User:fields\",\"to\":\"source:User:RiskStatus:\",\"fromPort\":\"source:User:fields\",\"toPort\":\"source:User:RiskStatus:\",\"visible\":true,\"common\":false},{\"from\":\"source:User:fields\",\"to\":\"source:User:isEagreementSigned:\",\"fromPort\":\"source:User:fields\",\"toPort\":\"source:User:isEagreementSigned:\",\"visible\":true,\"common\":false},{\"from\":\"source:User:fields\",\"to\":\"source:User:isEngageProvisioned:\",\"fromPort\":\"source:User:fields\",\"toPort\":\"source:User:isEngageProvisioned:\",\"visible\":true,\"common\":false},{\"from\":\"source:User:fields\",\"to\":\"source:User:isUserEnrolled:\",\"fromPort\":\"source:User:fields\",\"toPort\":\"source:User:isUserEnrolled:\",\"visible\":true,\"common\":false},{\"from\":\"source:User:fields\",\"to\":\"source:User:serviceKey:\",\"fromPort\":\"source:User:fields\",\"toPort\":\"source:User:serviceKey:\",\"visible\":true,\"common\":false},{\"from\":\"source:User:fields\",\"to\":\"source:User:isUserExists:\",\"fromPort\":\"source:User:fields\",\"toPort\":\"source:User:isUserExists:\",\"visible\":true,\"common\":false},{\"from\":\"source:User:fields\",\"to\":\"source:User:communication:\",\"fromPort\":\"source:User:fields\",\"toPort\":\"source:User:communication:\",\"visible\":true,\"common\":false},{\"from\":\"source:User:fields\",\"to\":\"source:User:coreCommunication:\",\"fromPort\":\"source:User:fields\",\"toPort\":\"source:User:coreCommunication:\",\"visible\":true,\"common\":false},{\"from\":\"source:User:fields\",\"to\":\"source:User:feedbackUserId:\",\"fromPort\":\"source:User:fields\",\"toPort\":\"source:User:feedbackUserId:\",\"visible\":true,\"common\":false},{\"from\":\"source:User:fields\",\"to\":\"source:User:userlastname:\",\"fromPort\":\"source:User:fields\",\"toPort\":\"source:User:userlastname:\",\"visible\":true,\"common\":false},{\"from\":\"source:User:fields\",\"to\":\"source:User:isVIPCustomer:\",\"fromPort\":\"source:User:fields\",\"toPort\":\"source:User:isVIPCustomer:\",\"visible\":true,\"common\":false},{\"from\":\"source:User:fields\",\"to\":\"source:User:isSecurityQuestionConfigured:\",\"fromPort\":\"source:User:fields\",\"toPort\":\"source:User:isSecurityQuestionConfigured:\",\"visible\":true,\"common\":false},{\"from\":\"source:User:fields\",\"to\":\"source:User:ContactNumbers:\",\"fromPort\":\"source:User:fields\",\"toPort\":\"source:User:ContactNumbers:\",\"visible\":true,\"common\":false},{\"from\":\"source:User:fields\",\"to\":\"source:User:EmailIds:\",\"fromPort\":\"source:User:fields\",\"toPort\":\"source:User:EmailIds:\",\"visible\":true,\"common\":false},{\"from\":\"source:User:fields\",\"to\":\"source:User:partyID:\",\"fromPort\":\"source:User:fields\",\"toPort\":\"source:User:partyID:\",\"visible\":true,\"common\":false},{\"from\":\"source:User:fields\",\"to\":\"source:User:coreCustomerID:\",\"fromPort\":\"source:User:fields\",\"toPort\":\"source:User:coreCustomerID:\",\"visible\":true,\"common\":false},{\"from\":\"target\",\"to\":\"target:parameters\",\"fromPort\":\"target\",\"toPort\":\"target:parameters\",\"visible\":true,\"common\":false},{\"from\":\"target:parameters\",\"to\":\"target:accountNumber:\",\"fromPort\":\"target:parameters\",\"toPort\":\"target:accountNumber:\",\"visible\":true,\"common\":false},{\"from\":\"target:parameters\",\"to\":\"target:accountType:\",\"fromPort\":\"target:parameters\",\"toPort\":\"target:accountType:\",\"visible\":true,\"common\":false},{\"from\":\"target:parameters\",\"to\":\"target:Bank_id:\",\"fromPort\":\"target:parameters\",\"toPort\":\"target:Bank_id:\",\"visible\":true,\"common\":false},{\"from\":\"target:parameters\",\"to\":\"target:coreCustomerID:\",\"fromPort\":\"target:parameters\",\"toPort\":\"target:coreCustomerID:\",\"visible\":true,\"common\":false},{\"from\":\"target:parameters\",\"to\":\"target:Customer_id:\",\"fromPort\":\"target:parameters\",\"toPort\":\"target:Customer_id:\",\"visible\":true,\"common\":false},{\"from\":\"target:parameters\",\"to\":\"target:oldpassword:\",\"fromPort\":\"target:parameters\",\"toPort\":\"target:oldpassword:\",\"visible\":true,\"common\":false},{\"from\":\"target:parameters\",\"to\":\"target:partyID:\",\"fromPort\":\"target:parameters\",\"toPort\":\"target:partyID:\",\"visible\":true,\"common\":false},{\"from\":\"target:parameters\",\"to\":\"target:password:\",\"fromPort\":\"target:parameters\",\"toPort\":\"target:password:\",\"visible\":true,\"common\":false},{\"from\":\"target:parameters\",\"to\":\"target:Username:\",\"fromPort\":\"target:parameters\",\"toPort\":\"target:Username:\",\"visible\":true,\"common\":false}],\"blockCount\":{\"variableCount\":0},\"variableMap\":{},\"xmlMappingOverride\":true}",
    "oVisualMappingData" : "{\"nodeDataArray\":[{\"isGroup\":true,\"key\":\"response_out\",\"text\":\"User\",\"xy\":\"770 100\"},{\"isGroup\":true,\"key\":\"response_in\",\"text\":\"dbpProductServices (1.0).GetUserDetailsConcurrent\",\"xy\":\"150 100\"}],\"linkDataArray\":[{\"from\":\"target\",\"to\":\"target:User\",\"fromPort\":\"target\",\"toPort\":\"target:User\",\"visible\":true,\"common\":false},{\"from\":\"target:User\",\"to\":\"target:User:t_p_fields\",\"fromPort\":\"target:User\",\"toPort\":\"target:User:t_p_fields\",\"visible\":true,\"common\":false},{\"from\":\"target:User:t_p_fields\",\"to\":\"target:User:accountNumber:\",\"fromPort\":\"target:User:t_p_fields\",\"toPort\":\"target:User:accountNumber:\",\"visible\":true,\"common\":false},{\"from\":\"target:User:t_p_fields\",\"to\":\"target:User:accountType:\",\"fromPort\":\"target:User:t_p_fields\",\"toPort\":\"target:User:accountType:\",\"visible\":true,\"common\":false},{\"from\":\"target:User:t_p_fields\",\"to\":\"target:User:addressId:\",\"fromPort\":\"target:User:t_p_fields\",\"toPort\":\"target:User:addressId:\",\"visible\":true,\"common\":false},{\"from\":\"target:User:t_p_fields\",\"to\":\"target:User:addressLine1:\",\"fromPort\":\"target:User:t_p_fields\",\"toPort\":\"target:User:addressLine1:\",\"visible\":true,\"common\":false},{\"from\":\"target:User:t_p_fields\",\"to\":\"target:User:addressLine2:\",\"fromPort\":\"target:User:t_p_fields\",\"toPort\":\"target:User:addressLine2:\",\"visible\":true,\"common\":false},{\"from\":\"target:User:t_p_fields\",\"to\":\"target:User:addressType:\",\"fromPort\":\"target:User:t_p_fields\",\"toPort\":\"target:User:addressType:\",\"visible\":true,\"common\":false},{\"from\":\"target:User:t_p_fields\",\"to\":\"target:User:alertsTurnedOn:\",\"fromPort\":\"target:User:t_p_fields\",\"toPort\":\"target:User:alertsTurnedOn:\",\"visible\":true,\"common\":false},{\"from\":\"target:User:t_p_fields\",\"to\":\"target:User:areAccountStatementTermsAccepted:\",\"fromPort\":\"target:User:t_p_fields\",\"toPort\":\"target:User:areAccountStatementTermsAccepted:\",\"visible\":true,\"common\":false},{\"from\":\"target:User:t_p_fields\",\"to\":\"target:User:areDepositTermsAccepted:\",\"fromPort\":\"target:User:t_p_fields\",\"toPort\":\"target:User:areDepositTermsAccepted:\",\"visible\":true,\"common\":false},{\"from\":\"target:User:t_p_fields\",\"to\":\"target:User:bankName:\",\"fromPort\":\"target:User:t_p_fields\",\"toPort\":\"target:User:bankName:\",\"visible\":true,\"common\":false},{\"from\":\"target:User:t_p_fields\",\"to\":\"target:User:cardNumber:\",\"fromPort\":\"target:User:t_p_fields\",\"toPort\":\"target:User:cardNumber:\",\"visible\":true,\"common\":false},{\"from\":\"target:User:t_p_fields\",\"to\":\"target:User:city:\",\"fromPort\":\"target:User:t_p_fields\",\"toPort\":\"target:User:city:\",\"visible\":true,\"common\":false},{\"from\":\"target:User:t_p_fields\",\"to\":\"target:User:country:\",\"fromPort\":\"target:User:t_p_fields\",\"toPort\":\"target:User:country:\",\"visible\":true,\"common\":false},{\"from\":\"target:User:t_p_fields\",\"to\":\"target:User:currencyCode:\",\"fromPort\":\"target:User:t_p_fields\",\"toPort\":\"target:User:currencyCode:\",\"visible\":true,\"common\":false},{\"from\":\"target:User:t_p_fields\",\"to\":\"target:User:cvv:\",\"fromPort\":\"target:User:t_p_fields\",\"toPort\":\"target:User:cvv:\",\"visible\":true,\"common\":false},{\"from\":\"target:User:t_p_fields\",\"to\":\"target:User:dateOfBirth:\",\"fromPort\":\"target:User:t_p_fields\",\"toPort\":\"target:User:dateOfBirth:\",\"visible\":true,\"common\":false},{\"from\":\"target:User:t_p_fields\",\"to\":\"target:User:default_account_billPay:\",\"fromPort\":\"target:User:t_p_fields\",\"toPort\":\"target:User:default_account_billPay:\",\"visible\":true,\"common\":false},{\"from\":\"target:User:t_p_fields\",\"to\":\"target:User:default_account_cardless:\",\"fromPort\":\"target:User:t_p_fields\",\"toPort\":\"target:User:default_account_cardless:\",\"visible\":true,\"common\":false},{\"from\":\"target:User:t_p_fields\",\"to\":\"target:User:default_account_deposit:\",\"fromPort\":\"target:User:t_p_fields\",\"toPort\":\"target:User:default_account_deposit:\",\"visible\":true,\"common\":false},{\"from\":\"target:User:t_p_fields\",\"to\":\"target:User:default_account_payments:\",\"fromPort\":\"target:User:t_p_fields\",\"toPort\":\"target:User:default_account_payments:\",\"visible\":true,\"common\":false},{\"from\":\"target:User:t_p_fields\",\"to\":\"target:User:default_account_transfers:\",\"fromPort\":\"target:User:t_p_fields\",\"toPort\":\"target:User:default_account_transfers:\",\"visible\":true,\"common\":false},{\"from\":\"target:User:t_p_fields\",\"to\":\"target:User:default_from_account_p2p:\",\"fromPort\":\"target:User:t_p_fields\",\"toPort\":\"target:User:default_from_account_p2p:\",\"visible\":true,\"common\":false},{\"from\":\"target:User:t_p_fields\",\"to\":\"target:User:default_to_account_p2p:\",\"fromPort\":\"target:User:t_p_fields\",\"toPort\":\"target:User:default_to_account_p2p:\",\"visible\":true,\"common\":false},{\"from\":\"target:User:t_p_fields\",\"to\":\"target:User:email:\",\"fromPort\":\"target:User:t_p_fields\",\"toPort\":\"target:User:email:\",\"visible\":true,\"common\":false},{\"from\":\"target:User:t_p_fields\",\"to\":\"target:User:errmsg:\",\"fromPort\":\"target:User:t_p_fields\",\"toPort\":\"target:User:errmsg:\",\"visible\":true,\"common\":false},{\"from\":\"target:User:t_p_fields\",\"to\":\"target:User:isEmailEnabled:\",\"fromPort\":\"target:User:t_p_fields\",\"toPort\":\"target:User:isEmailEnabled:\",\"visible\":true,\"common\":false},{\"from\":\"target:User:t_p_fields\",\"to\":\"target:User:isPhoneEnabled:\",\"fromPort\":\"target:User:t_p_fields\",\"toPort\":\"target:User:isPhoneEnabled:\",\"visible\":true,\"common\":false},{\"from\":\"target:User:t_p_fields\",\"to\":\"target:User:isPinSet:\",\"fromPort\":\"target:User:t_p_fields\",\"toPort\":\"target:User:isPinSet:\",\"visible\":true,\"common\":false},{\"from\":\"target:User:t_p_fields\",\"to\":\"target:User:isPreferredAddress:\",\"fromPort\":\"target:User:t_p_fields\",\"toPort\":\"target:User:isPreferredAddress:\",\"visible\":true,\"common\":false},{\"from\":\"target:User:t_p_fields\",\"to\":\"target:User:lastlogintime:\",\"fromPort\":\"target:User:t_p_fields\",\"toPort\":\"target:User:lastlogintime:\",\"visible\":true,\"common\":false},{\"from\":\"target:User:t_p_fields\",\"to\":\"target:User:oldpassword:\",\"fromPort\":\"target:User:t_p_fields\",\"toPort\":\"target:User:oldpassword:\",\"visible\":true,\"common\":false},{\"from\":\"target:User:t_p_fields\",\"to\":\"target:User:otp:\",\"fromPort\":\"target:User:t_p_fields\",\"toPort\":\"target:User:otp:\",\"visible\":true,\"common\":false},{\"from\":\"target:User:t_p_fields\",\"to\":\"target:User:password:\",\"fromPort\":\"target:User:t_p_fields\",\"toPort\":\"target:User:password:\",\"visible\":true,\"common\":false},{\"from\":\"target:User:t_p_fields\",\"to\":\"target:User:phone:\",\"fromPort\":\"target:User:t_p_fields\",\"toPort\":\"target:User:phone:\",\"visible\":true,\"common\":false},{\"from\":\"target:User:t_p_fields\",\"to\":\"target:User:pin:\",\"fromPort\":\"target:User:t_p_fields\",\"toPort\":\"target:User:pin:\",\"visible\":true,\"common\":false},{\"from\":\"target:User:t_p_fields\",\"to\":\"target:User:result:\",\"fromPort\":\"target:User:t_p_fields\",\"toPort\":\"target:User:result:\",\"visible\":true,\"common\":false},{\"from\":\"target:User:t_p_fields\",\"to\":\"target:User:role:\",\"fromPort\":\"target:User:t_p_fields\",\"toPort\":\"target:User:role:\",\"visible\":true,\"common\":false},{\"from\":\"target:User:t_p_fields\",\"to\":\"target:User:secondaryemail:\",\"fromPort\":\"target:User:t_p_fields\",\"toPort\":\"target:User:secondaryemail:\",\"visible\":true,\"common\":false},{\"from\":\"target:User:t_p_fields\",\"to\":\"target:User:secondaryemail2:\",\"fromPort\":\"target:User:t_p_fields\",\"toPort\":\"target:User:secondaryemail2:\",\"visible\":true,\"common\":false},{\"from\":\"target:User:t_p_fields\",\"to\":\"target:User:secondaryphone:\",\"fromPort\":\"target:User:t_p_fields\",\"toPort\":\"target:User:secondaryphone:\",\"visible\":true,\"common\":false},{\"from\":\"target:User:t_p_fields\",\"to\":\"target:User:secondaryphone2:\",\"fromPort\":\"target:User:t_p_fields\",\"toPort\":\"target:User:secondaryphone2:\",\"visible\":true,\"common\":false},{\"from\":\"target:User:t_p_fields\",\"to\":\"target:User:ssn:\",\"fromPort\":\"target:User:t_p_fields\",\"toPort\":\"target:User:ssn:\",\"visible\":true,\"common\":false},{\"from\":\"target:User:t_p_fields\",\"to\":\"target:User:state:\",\"fromPort\":\"target:User:t_p_fields\",\"toPort\":\"target:User:state:\",\"visible\":true,\"common\":false},{\"from\":\"target:User:t_p_fields\",\"to\":\"target:User:success:\",\"fromPort\":\"target:User:t_p_fields\",\"toPort\":\"target:User:success:\",\"visible\":true,\"common\":false},{\"from\":\"target:User:t_p_fields\",\"to\":\"target:User:userfirstname:\",\"fromPort\":\"target:User:t_p_fields\",\"toPort\":\"target:User:userfirstname:\",\"visible\":true,\"common\":false},{\"from\":\"target:User:t_p_fields\",\"to\":\"target:User:userId:\",\"fromPort\":\"target:User:t_p_fields\",\"toPort\":\"target:User:userId:\",\"visible\":true,\"common\":false},{\"from\":\"target:User:t_p_fields\",\"to\":\"target:User:userImage:\",\"fromPort\":\"target:User:t_p_fields\",\"toPort\":\"target:User:userImage:\",\"visible\":true,\"common\":false},{\"from\":\"target:User:t_p_fields\",\"to\":\"target:User:LastName:\",\"fromPort\":\"target:User:t_p_fields\",\"toPort\":\"target:User:LastName:\",\"visible\":true,\"common\":false},{\"from\":\"target:User:t_p_fields\",\"to\":\"target:User:userName:\",\"fromPort\":\"target:User:t_p_fields\",\"toPort\":\"target:User:userName:\",\"visible\":true,\"common\":false},{\"from\":\"target:User:t_p_fields\",\"to\":\"target:User:zipcode:\",\"fromPort\":\"target:User:t_p_fields\",\"toPort\":\"target:User:zipcode:\",\"visible\":true,\"common\":false},{\"from\":\"target:User:t_p_fields\",\"to\":\"target:User:rating:\",\"fromPort\":\"target:User:t_p_fields\",\"toPort\":\"target:User:rating:\",\"visible\":true,\"common\":false},{\"from\":\"target:User:t_p_fields\",\"to\":\"target:User:featureRequest:\",\"fromPort\":\"target:User:t_p_fields\",\"toPort\":\"target:User:featureRequest:\",\"visible\":true,\"common\":false},{\"from\":\"target:User:t_p_fields\",\"to\":\"target:User:description:\",\"fromPort\":\"target:User:t_p_fields\",\"toPort\":\"target:User:description:\",\"visible\":true,\"common\":false},{\"from\":\"target:User:t_p_fields\",\"to\":\"target:User:default_account_wire:\",\"fromPort\":\"target:User:t_p_fields\",\"toPort\":\"target:User:default_account_wire:\",\"visible\":true,\"common\":false},{\"from\":\"target:User:t_p_fields\",\"to\":\"target:User:isWireTransferActivated:\",\"fromPort\":\"target:User:t_p_fields\",\"toPort\":\"target:User:isWireTransferActivated:\",\"visible\":true,\"common\":false},{\"from\":\"target:User:t_p_fields\",\"to\":\"target:User:isWireTransferEligible:\",\"fromPort\":\"target:User:t_p_fields\",\"toPort\":\"target:User:isWireTransferEligible:\",\"visible\":true,\"common\":false},{\"from\":\"target:User:t_p_fields\",\"to\":\"target:User:userImageURL:\",\"fromPort\":\"target:User:t_p_fields\",\"toPort\":\"target:User:userImageURL:\",\"visible\":true,\"common\":false},{\"from\":\"target:User:t_p_fields\",\"to\":\"target:User:modifiedByName:\",\"fromPort\":\"target:User:t_p_fields\",\"toPort\":\"target:User:modifiedByName:\",\"visible\":true,\"common\":false},{\"from\":\"target:User:t_p_fields\",\"to\":\"target:User:Addresses:\",\"fromPort\":\"target:User:t_p_fields\",\"toPort\":\"target:User:Addresses:\",\"visible\":true,\"common\":false},{\"from\":\"target:User:t_p_fields\",\"to\":\"target:User:phoneNumbers:\",\"fromPort\":\"target:User:t_p_fields\",\"toPort\":\"target:User:phoneNumbers:\",\"visible\":true,\"common\":false},{\"from\":\"target:User:t_p_fields\",\"to\":\"target:User:preferredContactMethod:\",\"fromPort\":\"target:User:t_p_fields\",\"toPort\":\"target:User:preferredContactMethod:\",\"visible\":true,\"common\":false},{\"from\":\"target:User:t_p_fields\",\"to\":\"target:User:preferredContactTime:\",\"fromPort\":\"target:User:t_p_fields\",\"toPort\":\"target:User:preferredContactTime:\",\"visible\":true,\"common\":false},{\"from\":\"target:User:t_p_fields\",\"to\":\"target:User:deleteAddressID:\",\"fromPort\":\"target:User:t_p_fields\",\"toPort\":\"target:User:deleteAddressID:\",\"visible\":true,\"common\":false},{\"from\":\"target:User:t_p_fields\",\"to\":\"target:User:deleteCommunicationID:\",\"fromPort\":\"target:User:t_p_fields\",\"toPort\":\"target:User:deleteCommunicationID:\",\"visible\":true,\"common\":false},{\"from\":\"target:User:t_p_fields\",\"to\":\"target:User:maritalStatus:\",\"fromPort\":\"target:User:t_p_fields\",\"toPort\":\"target:User:maritalStatus:\",\"visible\":true,\"common\":false},{\"from\":\"target:User:t_p_fields\",\"to\":\"target:User:noOfDependents:\",\"fromPort\":\"target:User:t_p_fields\",\"toPort\":\"target:User:noOfDependents:\",\"visible\":true,\"common\":false},{\"from\":\"target:User:t_p_fields\",\"to\":\"target:User:spouseFirstName:\",\"fromPort\":\"target:User:t_p_fields\",\"toPort\":\"target:User:spouseFirstName:\",\"visible\":true,\"common\":false},{\"from\":\"target:User:t_p_fields\",\"to\":\"target:User:spouseLastName:\",\"fromPort\":\"target:User:t_p_fields\",\"toPort\":\"target:User:spouseLastName:\",\"visible\":true,\"common\":false},{\"from\":\"target:User:t_p_fields\",\"to\":\"target:User:gender:\",\"fromPort\":\"target:User:t_p_fields\",\"toPort\":\"target:User:gender:\",\"visible\":true,\"common\":false},{\"from\":\"target:User:t_p_fields\",\"to\":\"target:User:showBillPayFromAccPopup:\",\"fromPort\":\"target:User:t_p_fields\",\"toPort\":\"target:User:showBillPayFromAccPopup:\",\"visible\":true,\"common\":false},{\"from\":\"target:User:t_p_fields\",\"to\":\"target:User:isP2PActivated:\",\"fromPort\":\"target:User:t_p_fields\",\"toPort\":\"target:User:isP2PActivated:\",\"visible\":true,\"common\":false},{\"from\":\"target:User:t_p_fields\",\"to\":\"target:User:isP2PSupported:\",\"fromPort\":\"target:User:t_p_fields\",\"toPort\":\"target:User:isP2PSupported:\",\"visible\":true,\"common\":false},{\"from\":\"target:User:t_p_fields\",\"to\":\"target:User:isBillPaySupported:\",\"fromPort\":\"target:User:t_p_fields\",\"toPort\":\"target:User:isBillPaySupported:\",\"visible\":true,\"common\":false},{\"from\":\"target:User:t_p_fields\",\"to\":\"target:User:isBillPayActivated:\",\"fromPort\":\"target:User:t_p_fields\",\"toPort\":\"target:User:isBillPayActivated:\",\"visible\":true,\"common\":false},{\"from\":\"target:User:t_p_fields\",\"to\":\"target:User:securityKey:\",\"fromPort\":\"target:User:t_p_fields\",\"toPort\":\"target:User:securityKey:\",\"visible\":true,\"common\":false},{\"from\":\"target:User:t_p_fields\",\"to\":\"target:User:phoneExtension:\",\"fromPort\":\"target:User:t_p_fields\",\"toPort\":\"target:User:phoneExtension:\",\"visible\":true,\"common\":false},{\"from\":\"target:User:t_p_fields\",\"to\":\"target:User:phoneCountryCode:\",\"fromPort\":\"target:User:t_p_fields\",\"toPort\":\"target:User:phoneCountryCode:\",\"visible\":true,\"common\":false},{\"from\":\"target:User:t_p_fields\",\"to\":\"target:User:idmConfig:\",\"fromPort\":\"target:User:t_p_fields\",\"toPort\":\"target:User:idmConfig:\",\"visible\":true,\"common\":false},{\"from\":\"target:User:t_p_fields\",\"to\":\"target:User:errCode:\",\"fromPort\":\"target:User:t_p_fields\",\"toPort\":\"target:User:errCode:\",\"visible\":true,\"common\":false},{\"from\":\"target:User:t_p_fields\",\"to\":\"target:User:errorMessage:\",\"fromPort\":\"target:User:t_p_fields\",\"toPort\":\"target:User:errorMessage:\",\"visible\":true,\"common\":false},{\"from\":\"target:User:t_p_fields\",\"to\":\"target:User:errorCode:\",\"fromPort\":\"target:User:t_p_fields\",\"toPort\":\"target:User:errorCode:\",\"visible\":true,\"common\":false},{\"from\":\"target:User:t_p_fields\",\"to\":\"target:User:Id:\",\"fromPort\":\"target:User:t_p_fields\",\"toPort\":\"target:User:Id:\",\"visible\":true,\"common\":false},{\"from\":\"target:User:t_p_fields\",\"to\":\"target:User:RiskStatus:\",\"fromPort\":\"target:User:t_p_fields\",\"toPort\":\"target:User:RiskStatus:\",\"visible\":true,\"common\":false},{\"from\":\"target:User:t_p_fields\",\"to\":\"target:User:isEagreementSigned:\",\"fromPort\":\"target:User:t_p_fields\",\"toPort\":\"target:User:isEagreementSigned:\",\"visible\":true,\"common\":false},{\"from\":\"target:User:t_p_fields\",\"to\":\"target:User:isEngageProvisioned:\",\"fromPort\":\"target:User:t_p_fields\",\"toPort\":\"target:User:isEngageProvisioned:\",\"visible\":true,\"common\":false},{\"from\":\"target:User:t_p_fields\",\"to\":\"target:User:isUserEnrolled:\",\"fromPort\":\"target:User:t_p_fields\",\"toPort\":\"target:User:isUserEnrolled:\",\"visible\":true,\"common\":false},{\"from\":\"target:User:t_p_fields\",\"to\":\"target:User:serviceKey:\",\"fromPort\":\"target:User:t_p_fields\",\"toPort\":\"target:User:serviceKey:\",\"visible\":true,\"common\":false},{\"from\":\"target:User:t_p_fields\",\"to\":\"target:User:isUserExists:\",\"fromPort\":\"target:User:t_p_fields\",\"toPort\":\"target:User:isUserExists:\",\"visible\":true,\"common\":false},{\"from\":\"target:User:t_p_fields\",\"to\":\"target:User:communication:\",\"fromPort\":\"target:User:t_p_fields\",\"toPort\":\"target:User:communication:\",\"visible\":true,\"common\":false},{\"from\":\"target:User:t_p_fields\",\"to\":\"target:User:coreCommunication:\",\"fromPort\":\"target:User:t_p_fields\",\"toPort\":\"target:User:coreCommunication:\",\"visible\":true,\"common\":false},{\"from\":\"target:User:t_p_fields\",\"to\":\"target:User:feedbackUserId:\",\"fromPort\":\"target:User:t_p_fields\",\"toPort\":\"target:User:feedbackUserId:\",\"visible\":true,\"common\":false},{\"from\":\"target:User:t_p_fields\",\"to\":\"target:User:userlastname:\",\"fromPort\":\"target:User:t_p_fields\",\"toPort\":\"target:User:userlastname:\",\"visible\":true,\"common\":false},{\"from\":\"target:User:t_p_fields\",\"to\":\"target:User:isVIPCustomer:\",\"fromPort\":\"target:User:t_p_fields\",\"toPort\":\"target:User:isVIPCustomer:\",\"visible\":true,\"common\":false},{\"from\":\"target:User:t_p_fields\",\"to\":\"target:User:isSecurityQuestionConfigured:\",\"fromPort\":\"target:User:t_p_fields\",\"toPort\":\"target:User:isSecurityQuestionConfigured:\",\"visible\":true,\"common\":false},{\"from\":\"target:User:t_p_fields\",\"to\":\"target:User:ContactNumbers:\",\"fromPort\":\"target:User:t_p_fields\",\"toPort\":\"target:User:ContactNumbers:\",\"visible\":true,\"common\":false},{\"from\":\"target:User:t_p_fields\",\"to\":\"target:User:EmailIds:\",\"fromPort\":\"target:User:t_p_fields\",\"toPort\":\"target:User:EmailIds:\",\"visible\":true,\"common\":false},{\"from\":\"target:User:t_p_fields\",\"to\":\"target:User:isTypeBusiness:\",\"fromPort\":\"target:User:t_p_fields\",\"toPort\":\"target:User:isTypeBusiness:\",\"visible\":true,\"common\":false},{\"from\":\"target:User:t_p_fields\",\"to\":\"target:User:partyID:\",\"fromPort\":\"target:User:t_p_fields\",\"toPort\":\"target:User:partyID:\",\"visible\":true,\"common\":false},{\"from\":\"target:User:t_p_fields\",\"to\":\"target:User:coreCustomerID:\",\"fromPort\":\"target:User:t_p_fields\",\"toPort\":\"target:User:coreCustomerID:\",\"visible\":true,\"common\":false},{\"from\":\"target:User:t_p_fields\",\"to\":\"target:User:isCombinedUser:\",\"fromPort\":\"target:User:t_p_fields\",\"toPort\":\"target:User:isCombinedUser:\",\"visible\":true,\"common\":false},{\"from\":\"target:User:t_p_fields\",\"to\":\"target:User:status:\",\"fromPort\":\"target:User:t_p_fields\",\"toPort\":\"target:User:status:\",\"visible\":true,\"common\":false},{\"from\":\"target:User:t_p_fields\",\"to\":\"target:User:identities:\",\"fromPort\":\"target:User:t_p_fields\",\"toPort\":\"target:User:identities:\",\"visible\":true,\"common\":false},{\"from\":\"target:User:t_p_fields\",\"to\":\"target:User:FirstName:\",\"fromPort\":\"target:User:t_p_fields\",\"toPort\":\"target:User:FirstName:\",\"visible\":true,\"common\":false},{\"from\":\"target:User:t_p_fields\",\"to\":\"target:User:TaxId:\",\"fromPort\":\"target:User:t_p_fields\",\"toPort\":\"target:User:TaxId:\",\"visible\":true,\"common\":false},{\"from\":\"target:User:t_p_fields\",\"to\":\"target:User:startDate:\",\"fromPort\":\"target:User:t_p_fields\",\"toPort\":\"target:User:startDate:\",\"visible\":true,\"common\":false},{\"from\":\"target:User:t_p_fields\",\"to\":\"target:User:referenceID:\",\"fromPort\":\"target:User:t_p_fields\",\"toPort\":\"target:User:referenceID:\",\"visible\":true,\"common\":false},{\"from\":\"target:User:t_p_fields\",\"to\":\"target:User:Customer_id:\",\"fromPort\":\"target:User:t_p_fields\",\"toPort\":\"target:User:Customer_id:\",\"visible\":true,\"common\":false},{\"from\":\"target:User:t_p_fields\",\"to\":\"target:User:isAlertsRequired:\",\"fromPort\":\"target:User:t_p_fields\",\"toPort\":\"target:User:isAlertsRequired:\",\"visible\":true,\"common\":false},{\"from\":\"target:User:t_p_fields\",\"to\":\"target:User:CoreCustomers:\",\"fromPort\":\"target:User:t_p_fields\",\"toPort\":\"target:User:CoreCustomers:\",\"visible\":true,\"common\":false},{\"from\":\"target:User:t_p_fields\",\"to\":\"target:User:coreCustomerName:\",\"fromPort\":\"target:User:t_p_fields\",\"toPort\":\"target:User:coreCustomerName:\",\"visible\":true,\"common\":false},{\"from\":\"target:User:t_p_fields\",\"to\":\"target:User:isBusiness:\",\"fromPort\":\"target:User:t_p_fields\",\"toPort\":\"target:User:isBusiness:\",\"visible\":true,\"common\":false},{\"from\":\"target:User:t_p_fields\",\"to\":\"target:User:isPrimary:\",\"fromPort\":\"target:User:t_p_fields\",\"toPort\":\"target:User:isPrimary:\",\"visible\":true,\"common\":false},{\"from\":\"target:User:t_p_fields\",\"to\":\"target:User:contractId:\",\"fromPort\":\"target:User:t_p_fields\",\"toPort\":\"target:User:contractId:\",\"visible\":true,\"common\":false},{\"from\":\"target:User:t_p_fields\",\"to\":\"target:User:communicationType:\",\"fromPort\":\"target:User:t_p_fields\",\"toPort\":\"target:User:communicationType:\",\"visible\":true,\"common\":false}],\"blockCount\":{\"variableCount\":0},\"variableMap\":{},\"xmlMappingOverride\":true}",
    "applyCommonMapping" : false,
    "applyRequestCommonMapping" : false,
    "applyResponseCommonMapping" : false,
    "backendMeta" : {
      "serviceName" : "dbpProductServices",
      "serviceVersion" : "1.0",
      "operationName" : "GetUserDetailsConcurrent"
    },
    "relationshipHierarchyMapping" : {
      "children" : [ ],
      "name" : "User",
      "actions" : {
        "get" : true
      },
      "selected" : true
    },
    "requestXmlMappingOverride" : true,
    "responseXmlMappingOverride" : true
  }
}