{
  "customCode" : {
    "responseProcessorName" : "com.kony.dbputilities.customersecurityservices.postprocessor.NewAccountOpeningPostProcessor"
  },
  "operationConfig" : {
    "name" : "newAccountOpening2573",
    "type" : "MappedToBackend",
    "cachable" : false,
    "smsEnabled" : false,
    "security" : "authorized_app_user",
    "responseEncoding" : "UTF-8",
    "httpMethod" : "GET",
    "decodeResponseBody" : false,
    "iMapping" : "<?xml version=\"1.0\" encoding=\"UTF-8\" standalone=\"yes\"?><mapper xmlns=\"http://www.kony.com/ns/mapper\"><map inputpath=\"request_in\" outputpath=\"request_out\"><set-param inputpath=\"productLi\" outputpath=\"productLi\"/></map></mapper>",
    "oMapping" : "<?xml version=\"1.0\" encoding=\"UTF-8\" standalone=\"yes\"?><mapper xmlns=\"http://www.kony.com/ns/mapper\">  <map inputpath=\"response_in\" outputpath=\"response_out\">    <set-param inputpath=\"success\" outputpath=\"success\"/>    <set-param inputpath=\"customerAccounts\" outputpath=\"customerAccounts\"/>  </map></mapper>",
    "oVisualMappingData" : "{\"nodeDataArray\":[{\"isGroup\":true,\"key\":\"response_out\",\"text\":\"Accounts\",\"xy\":\"770 100\"},{\"isGroup\":true,\"key\":\"response_in\",\"text\":\"dbpNonProductServices (1.0).newAccountOpening\",\"xy\":\"150 100\"}],\"linkDataArray\":[{\"from\":\"target\",\"to\":\"target:Accounts\",\"fromPort\":\"target\",\"toPort\":\"target:Accounts\",\"visible\":true,\"common\":false},{\"from\":\"target:Accounts\",\"to\":\"target:Accounts:fields\",\"fromPort\":\"target:Accounts\",\"toPort\":\"target:Accounts:fields\",\"visible\":true,\"common\":false},{\"from\":\"target:Accounts:fields\",\"to\":\"target:Accounts:accountHolder:\",\"fromPort\":\"target:Accounts:fields\",\"toPort\":\"target:Accounts:accountHolder:\",\"visible\":true,\"common\":false},{\"from\":\"target:Accounts:fields\",\"to\":\"target:Accounts:accountID:\",\"fromPort\":\"target:Accounts:fields\",\"toPort\":\"target:Accounts:accountID:\",\"visible\":true,\"common\":false},{\"from\":\"target:Accounts:fields\",\"to\":\"target:Accounts:accountli:\",\"fromPort\":\"target:Accounts:fields\",\"toPort\":\"target:Accounts:accountli:\",\"visible\":true,\"common\":false},{\"from\":\"target:Accounts:fields\",\"to\":\"target:Accounts:accountName:\",\"fromPort\":\"target:Accounts:fields\",\"toPort\":\"target:Accounts:accountName:\",\"visible\":true,\"common\":false},{\"from\":\"target:Accounts:fields\",\"to\":\"target:Accounts:accountPreference:\",\"fromPort\":\"target:Accounts:fields\",\"toPort\":\"target:Accounts:accountPreference:\",\"visible\":true,\"common\":false},{\"from\":\"target:Accounts:fields\",\"to\":\"target:Accounts:accountType:\",\"fromPort\":\"target:Accounts:fields\",\"toPort\":\"target:Accounts:accountType:\",\"visible\":true,\"common\":false},{\"from\":\"target:Accounts:fields\",\"to\":\"target:Accounts:availableBalance:\",\"fromPort\":\"target:Accounts:fields\",\"toPort\":\"target:Accounts:availableBalance:\",\"visible\":true,\"common\":false},{\"from\":\"target:Accounts:fields\",\"to\":\"target:Accounts:availableCredit:\",\"fromPort\":\"target:Accounts:fields\",\"toPort\":\"target:Accounts:availableCredit:\",\"visible\":true,\"common\":false},{\"from\":\"target:Accounts:fields\",\"to\":\"target:Accounts:availablePoints:\",\"fromPort\":\"target:Accounts:fields\",\"toPort\":\"target:Accounts:availablePoints:\",\"visible\":true,\"common\":false},{\"from\":\"target:Accounts:fields\",\"to\":\"target:Accounts:bankName:\",\"fromPort\":\"target:Accounts:fields\",\"toPort\":\"target:Accounts:bankName:\",\"visible\":true,\"common\":false},{\"from\":\"target:Accounts:fields\",\"to\":\"target:Accounts:bondInterest:\",\"fromPort\":\"target:Accounts:fields\",\"toPort\":\"target:Accounts:bondInterest:\",\"visible\":true,\"common\":false},{\"from\":\"target:Accounts:fields\",\"to\":\"target:Accounts:bondInterestLastYear:\",\"fromPort\":\"target:Accounts:fields\",\"toPort\":\"target:Accounts:bondInterestLastYear:\",\"visible\":true,\"common\":false},{\"from\":\"target:Accounts:fields\",\"to\":\"target:Accounts:bsbNum:\",\"fromPort\":\"target:Accounts:fields\",\"toPort\":\"target:Accounts:bsbNum:\",\"visible\":true,\"common\":false},{\"from\":\"target:Accounts:fields\",\"to\":\"target:Accounts:closingDate:\",\"fromPort\":\"target:Accounts:fields\",\"toPort\":\"target:Accounts:closingDate:\",\"visible\":true,\"common\":false},{\"from\":\"target:Accounts:fields\",\"to\":\"target:Accounts:creditCardNumber:\",\"fromPort\":\"target:Accounts:fields\",\"toPort\":\"target:Accounts:creditCardNumber:\",\"visible\":true,\"common\":false},{\"from\":\"target:Accounts:fields\",\"to\":\"target:Accounts:creditLimit:\",\"fromPort\":\"target:Accounts:fields\",\"toPort\":\"target:Accounts:creditLimit:\",\"visible\":true,\"common\":false},{\"from\":\"target:Accounts:fields\",\"to\":\"target:Accounts:currencyCode:\",\"fromPort\":\"target:Accounts:fields\",\"toPort\":\"target:Accounts:currencyCode:\",\"visible\":true,\"common\":false},{\"from\":\"target:Accounts:fields\",\"to\":\"target:Accounts:currentAmountDue:\",\"fromPort\":\"target:Accounts:fields\",\"toPort\":\"target:Accounts:currentAmountDue:\",\"visible\":true,\"common\":false},{\"from\":\"target:Accounts:fields\",\"to\":\"target:Accounts:currentBalance:\",\"fromPort\":\"target:Accounts:fields\",\"toPort\":\"target:Accounts:currentBalance:\",\"visible\":true,\"common\":false},{\"from\":\"target:Accounts:fields\",\"to\":\"target:Accounts:deviceID:\",\"fromPort\":\"target:Accounts:fields\",\"toPort\":\"target:Accounts:deviceID:\",\"visible\":true,\"common\":false},{\"from\":\"target:Accounts:fields\",\"to\":\"target:Accounts:dividendLastPaidAmount:\",\"fromPort\":\"target:Accounts:fields\",\"toPort\":\"target:Accounts:dividendLastPaidAmount:\",\"visible\":true,\"common\":false},{\"from\":\"target:Accounts:fields\",\"to\":\"target:Accounts:dividendLastPaidDate:\",\"fromPort\":\"target:Accounts:fields\",\"toPort\":\"target:Accounts:dividendLastPaidDate:\",\"visible\":true,\"common\":false},{\"from\":\"target:Accounts:fields\",\"to\":\"target:Accounts:dividendPaidYTD:\",\"fromPort\":\"target:Accounts:fields\",\"toPort\":\"target:Accounts:dividendPaidYTD:\",\"visible\":true,\"common\":false},{\"from\":\"target:Accounts:fields\",\"to\":\"target:Accounts:dividendRate:\",\"fromPort\":\"target:Accounts:fields\",\"toPort\":\"target:Accounts:dividendRate:\",\"visible\":true,\"common\":false},{\"from\":\"target:Accounts:fields\",\"to\":\"target:Accounts:dividendYTD:\",\"fromPort\":\"target:Accounts:fields\",\"toPort\":\"target:Accounts:dividendYTD:\",\"visible\":true,\"common\":false},{\"from\":\"target:Accounts:fields\",\"to\":\"target:Accounts:dueDate:\",\"fromPort\":\"target:Accounts:fields\",\"toPort\":\"target:Accounts:dueDate:\",\"visible\":true,\"common\":false},{\"from\":\"target:Accounts:fields\",\"to\":\"target:Accounts:errmsg:\",\"fromPort\":\"target:Accounts:fields\",\"toPort\":\"target:Accounts:errmsg:\",\"visible\":true,\"common\":false},{\"from\":\"target:Accounts:fields\",\"to\":\"target:Accounts:eStatementEnable:\",\"fromPort\":\"target:Accounts:fields\",\"toPort\":\"target:Accounts:eStatementEnable:\",\"visible\":true,\"common\":false},{\"from\":\"target:Accounts:fields\",\"to\":\"target:Accounts:favouriteStatus:\",\"fromPort\":\"target:Accounts:fields\",\"toPort\":\"target:Accounts:favouriteStatus:\",\"visible\":true,\"common\":false},{\"from\":\"target:Accounts:fields\",\"to\":\"target:Accounts:interestEarned:\",\"fromPort\":\"target:Accounts:fields\",\"toPort\":\"target:Accounts:interestEarned:\",\"visible\":true,\"common\":false},{\"from\":\"target:Accounts:fields\",\"to\":\"target:Accounts:interestPaidLastYear:\",\"fromPort\":\"target:Accounts:fields\",\"toPort\":\"target:Accounts:interestPaidLastYear:\",\"visible\":true,\"common\":false},{\"from\":\"target:Accounts:fields\",\"to\":\"target:Accounts:interestPaidPreviousYTD:\",\"fromPort\":\"target:Accounts:fields\",\"toPort\":\"target:Accounts:interestPaidPreviousYTD:\",\"visible\":true,\"common\":false},{\"from\":\"target:Accounts:fields\",\"to\":\"target:Accounts:interestPaidYTD:\",\"fromPort\":\"target:Accounts:fields\",\"toPort\":\"target:Accounts:interestPaidYTD:\",\"visible\":true,\"common\":false},{\"from\":\"target:Accounts:fields\",\"to\":\"target:Accounts:interestRate:\",\"fromPort\":\"target:Accounts:fields\",\"toPort\":\"target:Accounts:interestRate:\",\"visible\":true,\"common\":false},{\"from\":\"target:Accounts:fields\",\"to\":\"target:Accounts:isInternationalAccount:\",\"fromPort\":\"target:Accounts:fields\",\"toPort\":\"target:Accounts:isInternationalAccount:\",\"visible\":true,\"common\":false},{\"from\":\"target:Accounts:fields\",\"to\":\"target:Accounts:isPFM:\",\"fromPort\":\"target:Accounts:fields\",\"toPort\":\"target:Accounts:isPFM:\",\"visible\":true,\"common\":false},{\"from\":\"target:Accounts:fields\",\"to\":\"target:Accounts:jointHolders:\",\"fromPort\":\"target:Accounts:fields\",\"toPort\":\"target:Accounts:jointHolders:\",\"visible\":true,\"common\":false},{\"from\":\"target:Accounts:fields\",\"to\":\"target:Accounts:lastDividendPaidAmount:\",\"fromPort\":\"target:Accounts:fields\",\"toPort\":\"target:Accounts:lastDividendPaidAmount:\",\"visible\":true,\"common\":false},{\"from\":\"target:Accounts:fields\",\"to\":\"target:Accounts:lastDividendPaidDate:\",\"fromPort\":\"target:Accounts:fields\",\"toPort\":\"target:Accounts:lastDividendPaidDate:\",\"visible\":true,\"common\":false},{\"from\":\"target:Accounts:fields\",\"to\":\"target:Accounts:lastPaymentAmount:\",\"fromPort\":\"target:Accounts:fields\",\"toPort\":\"target:Accounts:lastPaymentAmount:\",\"visible\":true,\"common\":false},{\"from\":\"target:Accounts:fields\",\"to\":\"target:Accounts:lastPaymentDate:\",\"fromPort\":\"target:Accounts:fields\",\"toPort\":\"target:Accounts:lastPaymentDate:\",\"visible\":true,\"common\":false},{\"from\":\"target:Accounts:fields\",\"to\":\"target:Accounts:lastStatementBalance:\",\"fromPort\":\"target:Accounts:fields\",\"toPort\":\"target:Accounts:lastStatementBalance:\",\"visible\":true,\"common\":false},{\"from\":\"target:Accounts:fields\",\"to\":\"target:Accounts:lateFeesDue:\",\"fromPort\":\"target:Accounts:fields\",\"toPort\":\"target:Accounts:lateFeesDue:\",\"visible\":true,\"common\":false},{\"from\":\"target:Accounts:fields\",\"to\":\"target:Accounts:maturityAmount:\",\"fromPort\":\"target:Accounts:fields\",\"toPort\":\"target:Accounts:maturityAmount:\",\"visible\":true,\"common\":false},{\"from\":\"target:Accounts:fields\",\"to\":\"target:Accounts:maturityDate:\",\"fromPort\":\"target:Accounts:fields\",\"toPort\":\"target:Accounts:maturityDate:\",\"visible\":true,\"common\":false},{\"from\":\"target:Accounts:fields\",\"to\":\"target:Accounts:maturityOption:\",\"fromPort\":\"target:Accounts:fields\",\"toPort\":\"target:Accounts:maturityOption:\",\"visible\":true,\"common\":false},{\"from\":\"target:Accounts:fields\",\"to\":\"target:Accounts:minimumDue:\",\"fromPort\":\"target:Accounts:fields\",\"toPort\":\"target:Accounts:minimumDue:\",\"visible\":true,\"common\":false},{\"from\":\"target:Accounts:fields\",\"to\":\"target:Accounts:nickName:\",\"fromPort\":\"target:Accounts:fields\",\"toPort\":\"target:Accounts:nickName:\",\"visible\":true,\"common\":false},{\"from\":\"target:Accounts:fields\",\"to\":\"target:Accounts:openingDate:\",\"fromPort\":\"target:Accounts:fields\",\"toPort\":\"target:Accounts:openingDate:\",\"visible\":true,\"common\":false},{\"from\":\"target:Accounts:fields\",\"to\":\"target:Accounts:originalAmount:\",\"fromPort\":\"target:Accounts:fields\",\"toPort\":\"target:Accounts:originalAmount:\",\"visible\":true,\"common\":false},{\"from\":\"target:Accounts:fields\",\"to\":\"target:Accounts:outstandingBalance:\",\"fromPort\":\"target:Accounts:fields\",\"toPort\":\"target:Accounts:outstandingBalance:\",\"visible\":true,\"common\":false},{\"from\":\"target:Accounts:fields\",\"to\":\"target:Accounts:paymentDue:\",\"fromPort\":\"target:Accounts:fields\",\"toPort\":\"target:Accounts:paymentDue:\",\"visible\":true,\"common\":false},{\"from\":\"target:Accounts:fields\",\"to\":\"target:Accounts:paymentMethod:\",\"fromPort\":\"target:Accounts:fields\",\"toPort\":\"target:Accounts:paymentMethod:\",\"visible\":true,\"common\":false},{\"from\":\"target:Accounts:fields\",\"to\":\"target:Accounts:paymentTerm:\",\"fromPort\":\"target:Accounts:fields\",\"toPort\":\"target:Accounts:paymentTerm:\",\"visible\":true,\"common\":false},{\"from\":\"target:Accounts:fields\",\"to\":\"target:Accounts:payoffAmount:\",\"fromPort\":\"target:Accounts:fields\",\"toPort\":\"target:Accounts:payoffAmount:\",\"visible\":true,\"common\":false},{\"from\":\"target:Accounts:fields\",\"to\":\"target:Accounts:payOffCharge:\",\"fromPort\":\"target:Accounts:fields\",\"toPort\":\"target:Accounts:payOffCharge:\",\"visible\":true,\"common\":false},{\"from\":\"target:Accounts:fields\",\"to\":\"target:Accounts:pendingDeposit:\",\"fromPort\":\"target:Accounts:fields\",\"toPort\":\"target:Accounts:pendingDeposit:\",\"visible\":true,\"common\":false},{\"from\":\"target:Accounts:fields\",\"to\":\"target:Accounts:pendingWithdrawal:\",\"fromPort\":\"target:Accounts:fields\",\"toPort\":\"target:Accounts:pendingWithdrawal:\",\"visible\":true,\"common\":false},{\"from\":\"target:Accounts:fields\",\"to\":\"target:Accounts:phoneId:\",\"fromPort\":\"target:Accounts:fields\",\"toPort\":\"target:Accounts:phoneId:\",\"visible\":true,\"common\":false},{\"from\":\"target:Accounts:fields\",\"to\":\"target:Accounts:previousYearDividend:\",\"fromPort\":\"target:Accounts:fields\",\"toPort\":\"target:Accounts:previousYearDividend:\",\"visible\":true,\"common\":false},{\"from\":\"target:Accounts:fields\",\"to\":\"target:Accounts:previousYearsDividends:\",\"fromPort\":\"target:Accounts:fields\",\"toPort\":\"target:Accounts:previousYearsDividends:\",\"visible\":true,\"common\":false},{\"from\":\"target:Accounts:fields\",\"to\":\"target:Accounts:principalBalance:\",\"fromPort\":\"target:Accounts:fields\",\"toPort\":\"target:Accounts:principalBalance:\",\"visible\":true,\"common\":false},{\"from\":\"target:Accounts:fields\",\"to\":\"target:Accounts:principalValue:\",\"fromPort\":\"target:Accounts:fields\",\"toPort\":\"target:Accounts:principalValue:\",\"visible\":true,\"common\":false},{\"from\":\"target:Accounts:fields\",\"to\":\"target:Accounts:regularPaymentAmount:\",\"fromPort\":\"target:Accounts:fields\",\"toPort\":\"target:Accounts:regularPaymentAmount:\",\"visible\":true,\"common\":false},{\"from\":\"target:Accounts:fields\",\"to\":\"target:Accounts:routingNumber:\",\"fromPort\":\"target:Accounts:fields\",\"toPort\":\"target:Accounts:routingNumber:\",\"visible\":true,\"common\":false},{\"from\":\"target:Accounts:fields\",\"to\":\"target:Accounts:success:\",\"fromPort\":\"target:Accounts:fields\",\"toPort\":\"target:Accounts:success:\",\"visible\":true,\"common\":false},{\"from\":\"target:Accounts:fields\",\"to\":\"target:Accounts:supportBillPay:\",\"fromPort\":\"target:Accounts:fields\",\"toPort\":\"target:Accounts:supportBillPay:\",\"visible\":true,\"common\":false},{\"from\":\"target:Accounts:fields\",\"to\":\"target:Accounts:supportCardlessCash:\",\"fromPort\":\"target:Accounts:fields\",\"toPort\":\"target:Accounts:supportCardlessCash:\",\"visible\":true,\"common\":false},{\"from\":\"target:Accounts:fields\",\"to\":\"target:Accounts:supportDeposit:\",\"fromPort\":\"target:Accounts:fields\",\"toPort\":\"target:Accounts:supportDeposit:\",\"visible\":true,\"common\":false},{\"from\":\"target:Accounts:fields\",\"to\":\"target:Accounts:supportTransferFrom:\",\"fromPort\":\"target:Accounts:fields\",\"toPort\":\"target:Accounts:supportTransferFrom:\",\"visible\":true,\"common\":false},{\"from\":\"target:Accounts:fields\",\"to\":\"target:Accounts:supportTransferTo:\",\"fromPort\":\"target:Accounts:fields\",\"toPort\":\"target:Accounts:supportTransferTo:\",\"visible\":true,\"common\":false},{\"from\":\"target:Accounts:fields\",\"to\":\"target:Accounts:swiftCode:\",\"fromPort\":\"target:Accounts:fields\",\"toPort\":\"target:Accounts:swiftCode:\",\"visible\":true,\"common\":false},{\"from\":\"target:Accounts:fields\",\"to\":\"target:Accounts:totalCreditMonths:\",\"fromPort\":\"target:Accounts:fields\",\"toPort\":\"target:Accounts:totalCreditMonths:\",\"visible\":true,\"common\":false},{\"from\":\"target:Accounts:fields\",\"to\":\"target:Accounts:totalDebitsMonth:\",\"fromPort\":\"target:Accounts:fields\",\"toPort\":\"target:Accounts:totalDebitsMonth:\",\"visible\":true,\"common\":false},{\"from\":\"target:Accounts:fields\",\"to\":\"target:Accounts:transactionLimit:\",\"fromPort\":\"target:Accounts:fields\",\"toPort\":\"target:Accounts:transactionLimit:\",\"visible\":true,\"common\":false},{\"from\":\"target:Accounts:fields\",\"to\":\"target:Accounts:transferLimit:\",\"fromPort\":\"target:Accounts:fields\",\"toPort\":\"target:Accounts:transferLimit:\",\"visible\":true,\"common\":false},{\"from\":\"target:Accounts:fields\",\"to\":\"target:Accounts:unpaidInterest:\",\"fromPort\":\"target:Accounts:fields\",\"toPort\":\"target:Accounts:unpaidInterest:\",\"visible\":true,\"common\":false},{\"from\":\"target:Accounts:fields\",\"to\":\"target:Accounts:userName:\",\"fromPort\":\"target:Accounts:fields\",\"toPort\":\"target:Accounts:userName:\",\"visible\":true,\"common\":false},{\"from\":\"target:Accounts:fields\",\"to\":\"target:Accounts:email:\",\"fromPort\":\"target:Accounts:fields\",\"toPort\":\"target:Accounts:email:\",\"visible\":true,\"common\":false},{\"from\":\"target:Accounts:fields\",\"to\":\"target:Accounts:jointAccountHolder1:\",\"fromPort\":\"target:Accounts:fields\",\"toPort\":\"target:Accounts:jointAccountHolder1:\",\"visible\":true,\"common\":false},{\"from\":\"target:Accounts:fields\",\"to\":\"target:Accounts:jointAccountHolder2:\",\"fromPort\":\"target:Accounts:fields\",\"toPort\":\"target:Accounts:jointAccountHolder2:\",\"visible\":true,\"common\":false},{\"from\":\"target:Accounts:fields\",\"to\":\"target:Accounts:bankAddress:\",\"fromPort\":\"target:Accounts:fields\",\"toPort\":\"target:Accounts:bankAddress:\",\"visible\":true,\"common\":false},{\"from\":\"target:Accounts:fields\",\"to\":\"target:Accounts:intermediaryBankName:\",\"fromPort\":\"target:Accounts:fields\",\"toPort\":\"target:Accounts:intermediaryBankName:\",\"visible\":true,\"common\":false},{\"from\":\"target:Accounts:fields\",\"to\":\"target:Accounts:intermediaryBankAddress:\",\"fromPort\":\"target:Accounts:fields\",\"toPort\":\"target:Accounts:intermediaryBankAddress:\",\"visible\":true,\"common\":false},{\"from\":\"target:Accounts:fields\",\"to\":\"target:Accounts:intermediaryBankSwiftCode:\",\"fromPort\":\"target:Accounts:fields\",\"toPort\":\"target:Accounts:intermediaryBankSwiftCode:\",\"visible\":true,\"common\":false},{\"from\":\"target:Accounts:fields\",\"to\":\"target:Accounts:StatusDesc:\",\"fromPort\":\"target:Accounts:fields\",\"toPort\":\"target:Accounts:StatusDesc:\",\"visible\":true,\"common\":false},{\"from\":\"target:Accounts:fields\",\"to\":\"target:Accounts:supportChecks:\",\"fromPort\":\"target:Accounts:fields\",\"toPort\":\"target:Accounts:supportChecks:\",\"visible\":true,\"common\":false},{\"from\":\"target:Accounts:fields\",\"to\":\"target:Accounts:serviceName:\",\"fromPort\":\"target:Accounts:fields\",\"toPort\":\"target:Accounts:serviceName:\",\"visible\":true,\"common\":false},{\"from\":\"target:Accounts:fields\",\"to\":\"target:Accounts:productLi:\",\"fromPort\":\"target:Accounts:fields\",\"toPort\":\"target:Accounts:productLi:\",\"visible\":true,\"common\":false},{\"from\":\"target:Accounts:fields\",\"to\":\"target:Accounts:phone:\",\"fromPort\":\"target:Accounts:fields\",\"toPort\":\"target:Accounts:phone:\",\"visible\":true,\"common\":false},{\"from\":\"target:Accounts:fields\",\"to\":\"target:Accounts:accountSubType:\",\"fromPort\":\"target:Accounts:fields\",\"toPort\":\"target:Accounts:accountSubType:\",\"visible\":true,\"common\":false},{\"from\":\"target:Accounts:fields\",\"to\":\"target:Accounts:description:\",\"fromPort\":\"target:Accounts:fields\",\"toPort\":\"target:Accounts:description:\",\"visible\":true,\"common\":false},{\"from\":\"target:Accounts:fields\",\"to\":\"target:Accounts:schemeName:\",\"fromPort\":\"target:Accounts:fields\",\"toPort\":\"target:Accounts:schemeName:\",\"visible\":true,\"common\":false},{\"from\":\"target:Accounts:fields\",\"to\":\"target:Accounts:identification:\",\"fromPort\":\"target:Accounts:fields\",\"toPort\":\"target:Accounts:identification:\",\"visible\":true,\"common\":false},{\"from\":\"target:Accounts:fields\",\"to\":\"target:Accounts:secondaryIdentification:\",\"fromPort\":\"target:Accounts:fields\",\"toPort\":\"target:Accounts:secondaryIdentification:\",\"visible\":true,\"common\":false},{\"from\":\"target:Accounts:fields\",\"to\":\"target:Accounts:servicerSchemeName:\",\"fromPort\":\"target:Accounts:fields\",\"toPort\":\"target:Accounts:servicerSchemeName:\",\"visible\":true,\"common\":false},{\"from\":\"target:Accounts:fields\",\"to\":\"target:Accounts:servicerIdentification:\",\"fromPort\":\"target:Accounts:fields\",\"toPort\":\"target:Accounts:servicerIdentification:\",\"visible\":true,\"common\":false},{\"from\":\"target:Accounts:fields\",\"to\":\"target:Accounts:dataCreditDebitIndicator:\",\"fromPort\":\"target:Accounts:fields\",\"toPort\":\"target:Accounts:dataCreditDebitIndicator:\",\"visible\":true,\"common\":false},{\"from\":\"target:Accounts:fields\",\"to\":\"target:Accounts:dataType:\",\"fromPort\":\"target:Accounts:fields\",\"toPort\":\"target:Accounts:dataType:\",\"visible\":true,\"common\":false},{\"from\":\"target:Accounts:fields\",\"to\":\"target:Accounts:dataDateTime:\",\"fromPort\":\"target:Accounts:fields\",\"toPort\":\"target:Accounts:dataDateTime:\",\"visible\":true,\"common\":false},{\"from\":\"target:Accounts:fields\",\"to\":\"target:Accounts:dataCreditLineIncluded:\",\"fromPort\":\"target:Accounts:fields\",\"toPort\":\"target:Accounts:dataCreditLineIncluded:\",\"visible\":true,\"common\":false},{\"from\":\"target:Accounts:fields\",\"to\":\"target:Accounts:dataCreditLineType:\",\"fromPort\":\"target:Accounts:fields\",\"toPort\":\"target:Accounts:dataCreditLineType:\",\"visible\":true,\"common\":false},{\"from\":\"target:Accounts:fields\",\"to\":\"target:Accounts:dataCreditLineAmount:\",\"fromPort\":\"target:Accounts:fields\",\"toPort\":\"target:Accounts:dataCreditLineAmount:\",\"visible\":true,\"common\":false},{\"from\":\"target:Accounts:fields\",\"to\":\"target:Accounts:dataCreditLineCurrency:\",\"fromPort\":\"target:Accounts:fields\",\"toPort\":\"target:Accounts:dataCreditLineCurrency:\",\"visible\":true,\"common\":false},{\"from\":\"target:Accounts:fields\",\"to\":\"target:Accounts:IBAN:\",\"fromPort\":\"target:Accounts:fields\",\"toPort\":\"target:Accounts:IBAN:\",\"visible\":true,\"common\":false},{\"from\":\"target:Accounts:fields\",\"to\":\"target:Accounts:displayName:\",\"fromPort\":\"target:Accounts:fields\",\"toPort\":\"target:Accounts:displayName:\",\"visible\":true,\"common\":false},{\"from\":\"target:Accounts:fields\",\"to\":\"target:Accounts:Account_id:\",\"fromPort\":\"target:Accounts:fields\",\"toPort\":\"target:Accounts:Account_id:\",\"visible\":true,\"common\":false},{\"from\":\"target:Accounts:fields\",\"to\":\"target:Accounts:Organization_Id:\",\"fromPort\":\"target:Accounts:fields\",\"toPort\":\"target:Accounts:Organization_Id:\",\"visible\":true,\"common\":false},{\"from\":\"target:Accounts:fields\",\"to\":\"target:Accounts:Account_Type:\",\"fromPort\":\"target:Accounts:fields\",\"toPort\":\"target:Accounts:Account_Type:\",\"visible\":true,\"common\":false},{\"from\":\"target:Accounts:fields\",\"to\":\"target:Accounts:Customer_id:\",\"fromPort\":\"target:Accounts:fields\",\"toPort\":\"target:Accounts:Customer_id:\",\"visible\":true,\"common\":false},{\"from\":\"target:Accounts:fields\",\"to\":\"target:Accounts:Membership_id:\",\"fromPort\":\"target:Accounts:fields\",\"toPort\":\"target:Accounts:Membership_id:\",\"visible\":true,\"common\":false},{\"from\":\"target:Accounts:fields\",\"to\":\"target:Accounts:Taxid:\",\"fromPort\":\"target:Accounts:fields\",\"toPort\":\"target:Accounts:Taxid:\",\"visible\":true,\"common\":false},{\"from\":\"target:Accounts:fields\",\"to\":\"target:Accounts:CustomerType:\",\"fromPort\":\"target:Accounts:fields\",\"toPort\":\"target:Accounts:CustomerType:\",\"visible\":true,\"common\":false},{\"from\":\"target:Accounts:fields\",\"to\":\"target:Accounts:Ssn:\",\"fromPort\":\"target:Accounts:fields\",\"toPort\":\"target:Accounts:Ssn:\",\"visible\":true,\"common\":false},{\"from\":\"target:Accounts:fields\",\"to\":\"target:Accounts:Status:\",\"fromPort\":\"target:Accounts:fields\",\"toPort\":\"target:Accounts:Status:\",\"visible\":true,\"common\":false},{\"from\":\"target:Accounts:fields\",\"to\":\"target:Accounts:searchString:\",\"fromPort\":\"target:Accounts:fields\",\"toPort\":\"target:Accounts:searchString:\",\"visible\":true,\"common\":false},{\"from\":\"target:Accounts:fields\",\"to\":\"target:Accounts:Ownership:\",\"fromPort\":\"target:Accounts:fields\",\"toPort\":\"target:Accounts:Ownership:\",\"visible\":true,\"common\":false},{\"from\":\"target:Accounts:fields\",\"to\":\"target:Accounts:LastUpdated:\",\"fromPort\":\"target:Accounts:fields\",\"toPort\":\"target:Accounts:LastUpdated:\",\"visible\":true,\"common\":false},{\"from\":\"target:Accounts:fields\",\"to\":\"target:Accounts:ActualUpdatedBY:\",\"fromPort\":\"target:Accounts:fields\",\"toPort\":\"target:Accounts:ActualUpdatedBY:\",\"visible\":true,\"common\":false},{\"from\":\"target:Accounts:fields\",\"to\":\"target:Accounts:UpdatedBy:\",\"fromPort\":\"target:Accounts:fields\",\"toPort\":\"target:Accounts:UpdatedBy:\",\"visible\":true,\"common\":false},{\"from\":\"target:Accounts:fields\",\"to\":\"target:Accounts:userId:\",\"fromPort\":\"target:Accounts:fields\",\"toPort\":\"target:Accounts:userId:\",\"visible\":true,\"common\":false},{\"from\":\"target:Accounts:fields\",\"to\":\"target:Accounts:address:\",\"fromPort\":\"target:Accounts:fields\",\"toPort\":\"target:Accounts:address:\",\"visible\":true,\"common\":false},{\"from\":\"target:Accounts:fields\",\"to\":\"target:Accounts:dateOfBirth:\",\"fromPort\":\"target:Accounts:fields\",\"toPort\":\"target:Accounts:dateOfBirth:\",\"visible\":true,\"common\":false},{\"from\":\"target:Accounts:fields\",\"to\":\"target:Accounts:firstName:\",\"fromPort\":\"target:Accounts:fields\",\"toPort\":\"target:Accounts:firstName:\",\"visible\":true,\"common\":false},{\"from\":\"target:Accounts:fields\",\"to\":\"target:Accounts:lastName:\",\"fromPort\":\"target:Accounts:fields\",\"toPort\":\"target:Accounts:lastName:\",\"visible\":true,\"common\":false},{\"from\":\"target:Accounts:fields\",\"to\":\"target:Accounts:stateId:\",\"fromPort\":\"target:Accounts:fields\",\"toPort\":\"target:Accounts:stateId:\",\"visible\":true,\"common\":false},{\"from\":\"target:Accounts:fields\",\"to\":\"target:Accounts:productId:\",\"fromPort\":\"target:Accounts:fields\",\"toPort\":\"target:Accounts:productId:\",\"visible\":true,\"common\":false},{\"from\":\"target:Accounts:fields\",\"to\":\"target:Accounts:payingAccount:\",\"fromPort\":\"target:Accounts:fields\",\"toPort\":\"target:Accounts:payingAccount:\",\"visible\":true,\"common\":false},{\"from\":\"target:Accounts:fields\",\"to\":\"target:Accounts:payoutAccount:\",\"fromPort\":\"target:Accounts:fields\",\"toPort\":\"target:Accounts:payoutAccount:\",\"visible\":true,\"common\":false},{\"from\":\"target:Accounts:fields\",\"to\":\"target:Accounts:amount:\",\"fromPort\":\"target:Accounts:fields\",\"toPort\":\"target:Accounts:amount:\",\"visible\":true,\"common\":false},{\"from\":\"target:Accounts:fields\",\"to\":\"target:Accounts:duration:\",\"fromPort\":\"target:Accounts:fields\",\"toPort\":\"target:Accounts:duration:\",\"visible\":true,\"common\":false},{\"from\":\"target:Accounts:fields\",\"to\":\"target:Accounts:isBusinessAccount:\",\"fromPort\":\"target:Accounts:fields\",\"toPort\":\"target:Accounts:isBusinessAccount:\",\"visible\":true,\"common\":false},{\"from\":\"target:Accounts:fields\",\"to\":\"target:Accounts:actions:\",\"fromPort\":\"target:Accounts:fields\",\"toPort\":\"target:Accounts:actions:\",\"visible\":true,\"common\":false},{\"from\":\"target:Accounts:fields\",\"to\":\"target:Accounts:serviceKey:\",\"fromPort\":\"target:Accounts:fields\",\"toPort\":\"target:Accounts:serviceKey:\",\"visible\":true,\"common\":false},{\"from\":\"target:Accounts:fields\",\"to\":\"target:Accounts:membershipId:\",\"fromPort\":\"target:Accounts:fields\",\"toPort\":\"target:Accounts:membershipId:\",\"visible\":true,\"common\":false},{\"from\":\"target:Accounts:fields\",\"to\":\"target:Accounts:companyInformation:\",\"fromPort\":\"target:Accounts:fields\",\"toPort\":\"target:Accounts:companyInformation:\",\"visible\":true,\"common\":false},{\"from\":\"target:Accounts:fields\",\"to\":\"target:Accounts:customerInformation:\",\"fromPort\":\"target:Accounts:fields\",\"toPort\":\"target:Accounts:customerInformation:\",\"visible\":true,\"common\":false},{\"from\":\"target:Accounts:fields\",\"to\":\"target:Accounts:masterServiceKey:\",\"fromPort\":\"target:Accounts:fields\",\"toPort\":\"target:Accounts:masterServiceKey:\",\"visible\":true,\"common\":false},{\"from\":\"target:Accounts:fields\",\"to\":\"target:Accounts:isOrganizationAccount:\",\"fromPort\":\"target:Accounts:fields\",\"toPort\":\"target:Accounts:isOrganizationAccount:\",\"visible\":true,\"common\":false},{\"from\":\"target:Accounts:fields\",\"to\":\"target:Accounts:typeId:\",\"fromPort\":\"target:Accounts:fields\",\"toPort\":\"target:Accounts:typeId:\",\"visible\":true,\"common\":false},{\"from\":\"target:Accounts:fields\",\"to\":\"target:Accounts:MembershipName:\",\"fromPort\":\"target:Accounts:fields\",\"toPort\":\"target:Accounts:MembershipName:\",\"visible\":true,\"common\":false},{\"from\":\"target:Accounts:fields\",\"to\":\"target:Accounts:categoryId:\",\"fromPort\":\"target:Accounts:fields\",\"toPort\":\"target:Accounts:categoryId:\",\"visible\":true,\"common\":false},{\"from\":\"target:Accounts:fields\",\"to\":\"target:Accounts:connectionAlertDays:\",\"fromPort\":\"target:Accounts:fields\",\"toPort\":\"target:Accounts:connectionAlertDays:\",\"visible\":true,\"common\":false},{\"from\":\"target:Accounts:fields\",\"to\":\"target:Accounts:nextPaymentAmount:\",\"fromPort\":\"target:Accounts:fields\",\"toPort\":\"target:Accounts:nextPaymentAmount:\",\"visible\":true,\"common\":false},{\"from\":\"target:Accounts:fields\",\"to\":\"target:Accounts:expiresAt:\",\"fromPort\":\"target:Accounts:fields\",\"toPort\":\"target:Accounts:expiresAt:\",\"visible\":true,\"common\":false},{\"from\":\"target:Accounts:fields\",\"to\":\"target:Accounts:bankCode:\",\"fromPort\":\"target:Accounts:fields\",\"toPort\":\"target:Accounts:bankCode:\",\"visible\":true,\"common\":false},{\"from\":\"target:Accounts:fields\",\"to\":\"target:Accounts:nextPaymentDate:\",\"fromPort\":\"target:Accounts:fields\",\"toPort\":\"target:Accounts:nextPaymentDate:\",\"visible\":true,\"common\":false},{\"from\":\"target:Accounts:fields\",\"to\":\"target:Accounts:arrangementId:\",\"fromPort\":\"target:Accounts:fields\",\"toPort\":\"target:Accounts:arrangementId:\",\"visible\":true,\"common\":false},{\"from\":\"target:Accounts:fields\",\"to\":\"target:Accounts:name:\",\"fromPort\":\"target:Accounts:fields\",\"toPort\":\"target:Accounts:name:\",\"visible\":true,\"common\":false},{\"from\":\"target:Accounts:fields\",\"to\":\"target:Accounts:accountIds:\",\"fromPort\":\"target:Accounts:fields\",\"toPort\":\"target:Accounts:accountIds:\",\"visible\":true,\"common\":false},{\"from\":\"target:Accounts:fields\",\"to\":\"target:Accounts:customerId:\",\"fromPort\":\"target:Accounts:fields\",\"toPort\":\"target:Accounts:customerId:\",\"visible\":true,\"common\":false},{\"from\":\"target:Accounts:fields\",\"to\":\"target:Accounts:id:\",\"fromPort\":\"target:Accounts:fields\",\"toPort\":\"target:Accounts:id:\",\"visible\":true,\"common\":false},{\"from\":\"target:Accounts:fields\",\"to\":\"target:Accounts:dbpErrCode:\",\"fromPort\":\"target:Accounts:fields\",\"toPort\":\"target:Accounts:dbpErrCode:\",\"visible\":true,\"common\":false},{\"from\":\"target:Accounts:fields\",\"to\":\"target:Accounts:dbpErrMsg:\",\"fromPort\":\"target:Accounts:fields\",\"toPort\":\"target:Accounts:dbpErrMsg:\",\"visible\":true,\"common\":false},{\"from\":\"target:Accounts:fields\",\"to\":\"target:Accounts:blockedAmount:\",\"fromPort\":\"target:Accounts:fields\",\"toPort\":\"target:Accounts:blockedAmount:\",\"visible\":true,\"common\":false},{\"from\":\"target:Accounts:fields\",\"to\":\"target:Accounts:futureInstallmentsCount:\",\"fromPort\":\"target:Accounts:fields\",\"toPort\":\"target:Accounts:futureInstallmentsCount:\",\"visible\":true,\"common\":false},{\"from\":\"target:Accounts:fields\",\"to\":\"target:Accounts:overDueInstallmentsCount:\",\"fromPort\":\"target:Accounts:fields\",\"toPort\":\"target:Accounts:overDueInstallmentsCount:\",\"visible\":true,\"common\":false},{\"from\":\"target:Accounts:fields\",\"to\":\"target:Accounts:paidInstallmentsCount:\",\"fromPort\":\"target:Accounts:fields\",\"toPort\":\"target:Accounts:paidInstallmentsCount:\",\"visible\":true,\"common\":false},{\"from\":\"target:Accounts:fields\",\"to\":\"target:Accounts:installmentAmount:\",\"fromPort\":\"target:Accounts:fields\",\"toPort\":\"target:Accounts:installmentAmount:\",\"visible\":true,\"common\":false},{\"from\":\"target:Accounts:fields\",\"to\":\"target:Accounts:rePaymentFrequency:\",\"fromPort\":\"target:Accounts:fields\",\"toPort\":\"target:Accounts:rePaymentFrequency:\",\"visible\":true,\"common\":false},{\"from\":\"target:Accounts:fields\",\"to\":\"target:Accounts:sanctionedAmount:\",\"fromPort\":\"target:Accounts:fields\",\"toPort\":\"target:Accounts:sanctionedAmount:\",\"visible\":true,\"common\":false},{\"from\":\"target:Accounts:fields\",\"to\":\"target:Accounts:customerName:\",\"fromPort\":\"target:Accounts:fields\",\"toPort\":\"target:Accounts:customerName:\",\"visible\":true,\"common\":false},{\"from\":\"target:Accounts:fields\",\"to\":\"target:Accounts:sanctionedDate:\",\"fromPort\":\"target:Accounts:fields\",\"toPort\":\"target:Accounts:sanctionedDate:\",\"visible\":true,\"common\":false},{\"from\":\"source\",\"to\":\"source:parameters\",\"fromPort\":\"source\",\"toPort\":\"source:parameters\",\"visible\":true,\"common\":false},{\"from\":\"source:parameters\",\"to\":\"source:success:\",\"fromPort\":\"source:parameters\",\"toPort\":\"source:success:\",\"visible\":true,\"common\":false}],\"blockCount\":{\"variableCount\":0},\"variableMap\":{},\"xmlMappingOverride\":true}",
    "applyCommonMapping" : false,
    "applyRequestCommonMapping" : true,
    "applyResponseCommonMapping" : false,
    "backendMeta" : {
      "serviceName" : "dbpNonProductServices",
      "serviceVersion" : "1.0",
      "operationName" : "newAccountOpening"
    },
    "relationshipHierarchyMapping" : {
      "children" : [ ],
      "name" : "Accounts",
      "actions" : { },
      "selected" : true
    },
    "requestXmlMappingOverride" : false,
    "responseXmlMappingOverride" : true
  }
}