{
  "operationConfig" : {
    "name" : "AccountDetailsForCombinedStatements4695",
    "type" : "MappedToBackend",
    "cachable" : false,
    "smsEnabled" : false,
    "security" : "authorized_app_user",
    "responseEncoding" : "UTF-8",
    "httpMethod" : "GET",
    "decodeResponseBody" : false,
    "iMapping" : "<?xml version=\"1.0\" encoding=\"UTF-8\" standalone=\"yes\"?><mapper xmlns=\"http://www.kony.com/ns/mapper\">  <map inputpath=\"request_in\" outputpath=\"request_out\">    <set-param inputpath=\"accountID\" outputpath=\"accountID\"/>  </map></mapper>",
    "iVisualMappingData" : "{\"nodeDataArray\":[{\"isGroup\":true,\"key\":\"request_in\",\"text\":\"Accounts\",\"xy\":\"150 100\"},{\"isGroup\":true,\"key\":\"request_out\",\"text\":\"dbpNonProductServices (1.0).AccountDetailsForCombinedStatements\",\"xy\":\"770 100\"}],\"linkDataArray\":[{\"from\":\"source\",\"to\":\"source:Accounts\",\"fromPort\":\"source\",\"toPort\":\"source:Accounts\",\"visible\":true,\"common\":false},{\"from\":\"source:Accounts\",\"to\":\"source:Accounts:fields\",\"fromPort\":\"source:Accounts\",\"toPort\":\"source:Accounts:fields\",\"visible\":true,\"common\":false},{\"from\":\"source:Accounts:fields\",\"to\":\"source:Accounts:accountHolder:\",\"fromPort\":\"source:Accounts:fields\",\"toPort\":\"source:Accounts:accountHolder:\",\"visible\":true,\"common\":false},{\"from\":\"source:Accounts:fields\",\"to\":\"source:Accounts:accountID:\",\"fromPort\":\"source:Accounts:fields\",\"toPort\":\"source:Accounts:accountID:\",\"visible\":true,\"common\":false},{\"from\":\"source:Accounts:fields\",\"to\":\"source:Accounts:accountli:\",\"fromPort\":\"source:Accounts:fields\",\"toPort\":\"source:Accounts:accountli:\",\"visible\":true,\"common\":false},{\"from\":\"source:Accounts:fields\",\"to\":\"source:Accounts:accountName:\",\"fromPort\":\"source:Accounts:fields\",\"toPort\":\"source:Accounts:accountName:\",\"visible\":true,\"common\":false},{\"from\":\"source:Accounts:fields\",\"to\":\"source:Accounts:accountPreference:\",\"fromPort\":\"source:Accounts:fields\",\"toPort\":\"source:Accounts:accountPreference:\",\"visible\":true,\"common\":false},{\"from\":\"source:Accounts:fields\",\"to\":\"source:Accounts:accountType:\",\"fromPort\":\"source:Accounts:fields\",\"toPort\":\"source:Accounts:accountType:\",\"visible\":true,\"common\":false},{\"from\":\"source:Accounts:fields\",\"to\":\"source:Accounts:availableBalance:\",\"fromPort\":\"source:Accounts:fields\",\"toPort\":\"source:Accounts:availableBalance:\",\"visible\":true,\"common\":false},{\"from\":\"source:Accounts:fields\",\"to\":\"source:Accounts:availableCredit:\",\"fromPort\":\"source:Accounts:fields\",\"toPort\":\"source:Accounts:availableCredit:\",\"visible\":true,\"common\":false},{\"from\":\"source:Accounts:fields\",\"to\":\"source:Accounts:availablePoints:\",\"fromPort\":\"source:Accounts:fields\",\"toPort\":\"source:Accounts:availablePoints:\",\"visible\":true,\"common\":false},{\"from\":\"source:Accounts:fields\",\"to\":\"source:Accounts:bankName:\",\"fromPort\":\"source:Accounts:fields\",\"toPort\":\"source:Accounts:bankName:\",\"visible\":true,\"common\":false},{\"from\":\"source:Accounts:fields\",\"to\":\"source:Accounts:bondInterest:\",\"fromPort\":\"source:Accounts:fields\",\"toPort\":\"source:Accounts:bondInterest:\",\"visible\":true,\"common\":false},{\"from\":\"source:Accounts:fields\",\"to\":\"source:Accounts:bondInterestLastYear:\",\"fromPort\":\"source:Accounts:fields\",\"toPort\":\"source:Accounts:bondInterestLastYear:\",\"visible\":true,\"common\":false},{\"from\":\"source:Accounts:fields\",\"to\":\"source:Accounts:bsbNum:\",\"fromPort\":\"source:Accounts:fields\",\"toPort\":\"source:Accounts:bsbNum:\",\"visible\":true,\"common\":false},{\"from\":\"source:Accounts:fields\",\"to\":\"source:Accounts:closingDate:\",\"fromPort\":\"source:Accounts:fields\",\"toPort\":\"source:Accounts:closingDate:\",\"visible\":true,\"common\":false},{\"from\":\"source:Accounts:fields\",\"to\":\"source:Accounts:creditCardNumber:\",\"fromPort\":\"source:Accounts:fields\",\"toPort\":\"source:Accounts:creditCardNumber:\",\"visible\":true,\"common\":false},{\"from\":\"source:Accounts:fields\",\"to\":\"source:Accounts:creditLimit:\",\"fromPort\":\"source:Accounts:fields\",\"toPort\":\"source:Accounts:creditLimit:\",\"visible\":true,\"common\":false},{\"from\":\"source:Accounts:fields\",\"to\":\"source:Accounts:currencyCode:\",\"fromPort\":\"source:Accounts:fields\",\"toPort\":\"source:Accounts:currencyCode:\",\"visible\":true,\"common\":false},{\"from\":\"source:Accounts:fields\",\"to\":\"source:Accounts:currentAmountDue:\",\"fromPort\":\"source:Accounts:fields\",\"toPort\":\"source:Accounts:currentAmountDue:\",\"visible\":true,\"common\":false},{\"from\":\"source:Accounts:fields\",\"to\":\"source:Accounts:currentBalance:\",\"fromPort\":\"source:Accounts:fields\",\"toPort\":\"source:Accounts:currentBalance:\",\"visible\":true,\"common\":false},{\"from\":\"source:Accounts:fields\",\"to\":\"source:Accounts:deviceID:\",\"fromPort\":\"source:Accounts:fields\",\"toPort\":\"source:Accounts:deviceID:\",\"visible\":true,\"common\":false},{\"from\":\"source:Accounts:fields\",\"to\":\"source:Accounts:dividendLastPaidAmount:\",\"fromPort\":\"source:Accounts:fields\",\"toPort\":\"source:Accounts:dividendLastPaidAmount:\",\"visible\":true,\"common\":false},{\"from\":\"source:Accounts:fields\",\"to\":\"source:Accounts:dividendLastPaidDate:\",\"fromPort\":\"source:Accounts:fields\",\"toPort\":\"source:Accounts:dividendLastPaidDate:\",\"visible\":true,\"common\":false},{\"from\":\"source:Accounts:fields\",\"to\":\"source:Accounts:dividendPaidYTD:\",\"fromPort\":\"source:Accounts:fields\",\"toPort\":\"source:Accounts:dividendPaidYTD:\",\"visible\":true,\"common\":false},{\"from\":\"source:Accounts:fields\",\"to\":\"source:Accounts:dividendRate:\",\"fromPort\":\"source:Accounts:fields\",\"toPort\":\"source:Accounts:dividendRate:\",\"visible\":true,\"common\":false},{\"from\":\"source:Accounts:fields\",\"to\":\"source:Accounts:dividendYTD:\",\"fromPort\":\"source:Accounts:fields\",\"toPort\":\"source:Accounts:dividendYTD:\",\"visible\":true,\"common\":false},{\"from\":\"source:Accounts:fields\",\"to\":\"source:Accounts:dueDate:\",\"fromPort\":\"source:Accounts:fields\",\"toPort\":\"source:Accounts:dueDate:\",\"visible\":true,\"common\":false},{\"from\":\"source:Accounts:fields\",\"to\":\"source:Accounts:errmsg:\",\"fromPort\":\"source:Accounts:fields\",\"toPort\":\"source:Accounts:errmsg:\",\"visible\":true,\"common\":false},{\"from\":\"source:Accounts:fields\",\"to\":\"source:Accounts:eStatementEnable:\",\"fromPort\":\"source:Accounts:fields\",\"toPort\":\"source:Accounts:eStatementEnable:\",\"visible\":true,\"common\":false},{\"from\":\"source:Accounts:fields\",\"to\":\"source:Accounts:favouriteStatus:\",\"fromPort\":\"source:Accounts:fields\",\"toPort\":\"source:Accounts:favouriteStatus:\",\"visible\":true,\"common\":false},{\"from\":\"source:Accounts:fields\",\"to\":\"source:Accounts:interestEarned:\",\"fromPort\":\"source:Accounts:fields\",\"toPort\":\"source:Accounts:interestEarned:\",\"visible\":true,\"common\":false},{\"from\":\"source:Accounts:fields\",\"to\":\"source:Accounts:interestPaidLastYear:\",\"fromPort\":\"source:Accounts:fields\",\"toPort\":\"source:Accounts:interestPaidLastYear:\",\"visible\":true,\"common\":false},{\"from\":\"source:Accounts:fields\",\"to\":\"source:Accounts:interestPaidPreviousYTD:\",\"fromPort\":\"source:Accounts:fields\",\"toPort\":\"source:Accounts:interestPaidPreviousYTD:\",\"visible\":true,\"common\":false},{\"from\":\"source:Accounts:fields\",\"to\":\"source:Accounts:interestPaidYTD:\",\"fromPort\":\"source:Accounts:fields\",\"toPort\":\"source:Accounts:interestPaidYTD:\",\"visible\":true,\"common\":false},{\"from\":\"source:Accounts:fields\",\"to\":\"source:Accounts:interestRate:\",\"fromPort\":\"source:Accounts:fields\",\"toPort\":\"source:Accounts:interestRate:\",\"visible\":true,\"common\":false},{\"from\":\"source:Accounts:fields\",\"to\":\"source:Accounts:isInternationalAccount:\",\"fromPort\":\"source:Accounts:fields\",\"toPort\":\"source:Accounts:isInternationalAccount:\",\"visible\":true,\"common\":false},{\"from\":\"source:Accounts:fields\",\"to\":\"source:Accounts:isPFM:\",\"fromPort\":\"source:Accounts:fields\",\"toPort\":\"source:Accounts:isPFM:\",\"visible\":true,\"common\":false},{\"from\":\"source:Accounts:fields\",\"to\":\"source:Accounts:jointHolders:\",\"fromPort\":\"source:Accounts:fields\",\"toPort\":\"source:Accounts:jointHolders:\",\"visible\":true,\"common\":false},{\"from\":\"source:Accounts:fields\",\"to\":\"source:Accounts:lastDividendPaidAmount:\",\"fromPort\":\"source:Accounts:fields\",\"toPort\":\"source:Accounts:lastDividendPaidAmount:\",\"visible\":true,\"common\":false},{\"from\":\"source:Accounts:fields\",\"to\":\"source:Accounts:lastDividendPaidDate:\",\"fromPort\":\"source:Accounts:fields\",\"toPort\":\"source:Accounts:lastDividendPaidDate:\",\"visible\":true,\"common\":false},{\"from\":\"source:Accounts:fields\",\"to\":\"source:Accounts:lastPaymentAmount:\",\"fromPort\":\"source:Accounts:fields\",\"toPort\":\"source:Accounts:lastPaymentAmount:\",\"visible\":true,\"common\":false},{\"from\":\"source:Accounts:fields\",\"to\":\"source:Accounts:lastPaymentDate:\",\"fromPort\":\"source:Accounts:fields\",\"toPort\":\"source:Accounts:lastPaymentDate:\",\"visible\":true,\"common\":false},{\"from\":\"source:Accounts:fields\",\"to\":\"source:Accounts:lastStatementBalance:\",\"fromPort\":\"source:Accounts:fields\",\"toPort\":\"source:Accounts:lastStatementBalance:\",\"visible\":true,\"common\":false},{\"from\":\"source:Accounts:fields\",\"to\":\"source:Accounts:lateFeesDue:\",\"fromPort\":\"source:Accounts:fields\",\"toPort\":\"source:Accounts:lateFeesDue:\",\"visible\":true,\"common\":false},{\"from\":\"source:Accounts:fields\",\"to\":\"source:Accounts:maturityAmount:\",\"fromPort\":\"source:Accounts:fields\",\"toPort\":\"source:Accounts:maturityAmount:\",\"visible\":true,\"common\":false},{\"from\":\"source:Accounts:fields\",\"to\":\"source:Accounts:maturityDate:\",\"fromPort\":\"source:Accounts:fields\",\"toPort\":\"source:Accounts:maturityDate:\",\"visible\":true,\"common\":false},{\"from\":\"source:Accounts:fields\",\"to\":\"source:Accounts:maturityOption:\",\"fromPort\":\"source:Accounts:fields\",\"toPort\":\"source:Accounts:maturityOption:\",\"visible\":true,\"common\":false},{\"from\":\"source:Accounts:fields\",\"to\":\"source:Accounts:minimumDue:\",\"fromPort\":\"source:Accounts:fields\",\"toPort\":\"source:Accounts:minimumDue:\",\"visible\":true,\"common\":false},{\"from\":\"source:Accounts:fields\",\"to\":\"source:Accounts:nickName:\",\"fromPort\":\"source:Accounts:fields\",\"toPort\":\"source:Accounts:nickName:\",\"visible\":true,\"common\":false},{\"from\":\"source:Accounts:fields\",\"to\":\"source:Accounts:openingDate:\",\"fromPort\":\"source:Accounts:fields\",\"toPort\":\"source:Accounts:openingDate:\",\"visible\":true,\"common\":false},{\"from\":\"source:Accounts:fields\",\"to\":\"source:Accounts:originalAmount:\",\"fromPort\":\"source:Accounts:fields\",\"toPort\":\"source:Accounts:originalAmount:\",\"visible\":true,\"common\":false},{\"from\":\"source:Accounts:fields\",\"to\":\"source:Accounts:outstandingBalance:\",\"fromPort\":\"source:Accounts:fields\",\"toPort\":\"source:Accounts:outstandingBalance:\",\"visible\":true,\"common\":false},{\"from\":\"source:Accounts:fields\",\"to\":\"source:Accounts:paymentDue:\",\"fromPort\":\"source:Accounts:fields\",\"toPort\":\"source:Accounts:paymentDue:\",\"visible\":true,\"common\":false},{\"from\":\"source:Accounts:fields\",\"to\":\"source:Accounts:paymentMethod:\",\"fromPort\":\"source:Accounts:fields\",\"toPort\":\"source:Accounts:paymentMethod:\",\"visible\":true,\"common\":false},{\"from\":\"source:Accounts:fields\",\"to\":\"source:Accounts:paymentTerm:\",\"fromPort\":\"source:Accounts:fields\",\"toPort\":\"source:Accounts:paymentTerm:\",\"visible\":true,\"common\":false},{\"from\":\"source:Accounts:fields\",\"to\":\"source:Accounts:payoffAmount:\",\"fromPort\":\"source:Accounts:fields\",\"toPort\":\"source:Accounts:payoffAmount:\",\"visible\":true,\"common\":false},{\"from\":\"source:Accounts:fields\",\"to\":\"source:Accounts:payOffCharge:\",\"fromPort\":\"source:Accounts:fields\",\"toPort\":\"source:Accounts:payOffCharge:\",\"visible\":true,\"common\":false},{\"from\":\"source:Accounts:fields\",\"to\":\"source:Accounts:pendingDeposit:\",\"fromPort\":\"source:Accounts:fields\",\"toPort\":\"source:Accounts:pendingDeposit:\",\"visible\":true,\"common\":false},{\"from\":\"source:Accounts:fields\",\"to\":\"source:Accounts:pendingWithdrawal:\",\"fromPort\":\"source:Accounts:fields\",\"toPort\":\"source:Accounts:pendingWithdrawal:\",\"visible\":true,\"common\":false},{\"from\":\"source:Accounts:fields\",\"to\":\"source:Accounts:phoneId:\",\"fromPort\":\"source:Accounts:fields\",\"toPort\":\"source:Accounts:phoneId:\",\"visible\":true,\"common\":false},{\"from\":\"source:Accounts:fields\",\"to\":\"source:Accounts:previousYearDividend:\",\"fromPort\":\"source:Accounts:fields\",\"toPort\":\"source:Accounts:previousYearDividend:\",\"visible\":true,\"common\":false},{\"from\":\"source:Accounts:fields\",\"to\":\"source:Accounts:previousYearsDividends:\",\"fromPort\":\"source:Accounts:fields\",\"toPort\":\"source:Accounts:previousYearsDividends:\",\"visible\":true,\"common\":false},{\"from\":\"source:Accounts:fields\",\"to\":\"source:Accounts:principalBalance:\",\"fromPort\":\"source:Accounts:fields\",\"toPort\":\"source:Accounts:principalBalance:\",\"visible\":true,\"common\":false},{\"from\":\"source:Accounts:fields\",\"to\":\"source:Accounts:principalValue:\",\"fromPort\":\"source:Accounts:fields\",\"toPort\":\"source:Accounts:principalValue:\",\"visible\":true,\"common\":false},{\"from\":\"source:Accounts:fields\",\"to\":\"source:Accounts:regularPaymentAmount:\",\"fromPort\":\"source:Accounts:fields\",\"toPort\":\"source:Accounts:regularPaymentAmount:\",\"visible\":true,\"common\":false},{\"from\":\"source:Accounts:fields\",\"to\":\"source:Accounts:routingNumber:\",\"fromPort\":\"source:Accounts:fields\",\"toPort\":\"source:Accounts:routingNumber:\",\"visible\":true,\"common\":false},{\"from\":\"source:Accounts:fields\",\"to\":\"source:Accounts:success:\",\"fromPort\":\"source:Accounts:fields\",\"toPort\":\"source:Accounts:success:\",\"visible\":true,\"common\":false},{\"from\":\"source:Accounts:fields\",\"to\":\"source:Accounts:supportBillPay:\",\"fromPort\":\"source:Accounts:fields\",\"toPort\":\"source:Accounts:supportBillPay:\",\"visible\":true,\"common\":false},{\"from\":\"source:Accounts:fields\",\"to\":\"source:Accounts:supportCardlessCash:\",\"fromPort\":\"source:Accounts:fields\",\"toPort\":\"source:Accounts:supportCardlessCash:\",\"visible\":true,\"common\":false},{\"from\":\"source:Accounts:fields\",\"to\":\"source:Accounts:supportDeposit:\",\"fromPort\":\"source:Accounts:fields\",\"toPort\":\"source:Accounts:supportDeposit:\",\"visible\":true,\"common\":false},{\"from\":\"source:Accounts:fields\",\"to\":\"source:Accounts:supportTransferFrom:\",\"fromPort\":\"source:Accounts:fields\",\"toPort\":\"source:Accounts:supportTransferFrom:\",\"visible\":true,\"common\":false},{\"from\":\"source:Accounts:fields\",\"to\":\"source:Accounts:supportTransferTo:\",\"fromPort\":\"source:Accounts:fields\",\"toPort\":\"source:Accounts:supportTransferTo:\",\"visible\":true,\"common\":false},{\"from\":\"source:Accounts:fields\",\"to\":\"source:Accounts:swiftCode:\",\"fromPort\":\"source:Accounts:fields\",\"toPort\":\"source:Accounts:swiftCode:\",\"visible\":true,\"common\":false},{\"from\":\"source:Accounts:fields\",\"to\":\"source:Accounts:totalCreditMonths:\",\"fromPort\":\"source:Accounts:fields\",\"toPort\":\"source:Accounts:totalCreditMonths:\",\"visible\":true,\"common\":false},{\"from\":\"source:Accounts:fields\",\"to\":\"source:Accounts:totalDebitsMonth:\",\"fromPort\":\"source:Accounts:fields\",\"toPort\":\"source:Accounts:totalDebitsMonth:\",\"visible\":true,\"common\":false},{\"from\":\"source:Accounts:fields\",\"to\":\"source:Accounts:transactionLimit:\",\"fromPort\":\"source:Accounts:fields\",\"toPort\":\"source:Accounts:transactionLimit:\",\"visible\":true,\"common\":false},{\"from\":\"source:Accounts:fields\",\"to\":\"source:Accounts:transferLimit:\",\"fromPort\":\"source:Accounts:fields\",\"toPort\":\"source:Accounts:transferLimit:\",\"visible\":true,\"common\":false},{\"from\":\"source:Accounts:fields\",\"to\":\"source:Accounts:unpaidInterest:\",\"fromPort\":\"source:Accounts:fields\",\"toPort\":\"source:Accounts:unpaidInterest:\",\"visible\":true,\"common\":false},{\"from\":\"source:Accounts:fields\",\"to\":\"source:Accounts:userName:\",\"fromPort\":\"source:Accounts:fields\",\"toPort\":\"source:Accounts:userName:\",\"visible\":true,\"common\":false},{\"from\":\"source:Accounts:fields\",\"to\":\"source:Accounts:email:\",\"fromPort\":\"source:Accounts:fields\",\"toPort\":\"source:Accounts:email:\",\"visible\":true,\"common\":false},{\"from\":\"source:Accounts:fields\",\"to\":\"source:Accounts:jointAccountHolder1:\",\"fromPort\":\"source:Accounts:fields\",\"toPort\":\"source:Accounts:jointAccountHolder1:\",\"visible\":true,\"common\":false},{\"from\":\"source:Accounts:fields\",\"to\":\"source:Accounts:jointAccountHolder2:\",\"fromPort\":\"source:Accounts:fields\",\"toPort\":\"source:Accounts:jointAccountHolder2:\",\"visible\":true,\"common\":false},{\"from\":\"source:Accounts:fields\",\"to\":\"source:Accounts:bankAddress:\",\"fromPort\":\"source:Accounts:fields\",\"toPort\":\"source:Accounts:bankAddress:\",\"visible\":true,\"common\":false},{\"from\":\"source:Accounts:fields\",\"to\":\"source:Accounts:intermediaryBankName:\",\"fromPort\":\"source:Accounts:fields\",\"toPort\":\"source:Accounts:intermediaryBankName:\",\"visible\":true,\"common\":false},{\"from\":\"source:Accounts:fields\",\"to\":\"source:Accounts:intermediaryBankAddress:\",\"fromPort\":\"source:Accounts:fields\",\"toPort\":\"source:Accounts:intermediaryBankAddress:\",\"visible\":true,\"common\":false},{\"from\":\"source:Accounts:fields\",\"to\":\"source:Accounts:intermediaryBankSwiftCode:\",\"fromPort\":\"source:Accounts:fields\",\"toPort\":\"source:Accounts:intermediaryBankSwiftCode:\",\"visible\":true,\"common\":false},{\"from\":\"source:Accounts:fields\",\"to\":\"source:Accounts:StatusDesc:\",\"fromPort\":\"source:Accounts:fields\",\"toPort\":\"source:Accounts:StatusDesc:\",\"visible\":true,\"common\":false},{\"from\":\"source:Accounts:fields\",\"to\":\"source:Accounts:supportChecks:\",\"fromPort\":\"source:Accounts:fields\",\"toPort\":\"source:Accounts:supportChecks:\",\"visible\":true,\"common\":false},{\"from\":\"source:Accounts:fields\",\"to\":\"source:Accounts:serviceName:\",\"fromPort\":\"source:Accounts:fields\",\"toPort\":\"source:Accounts:serviceName:\",\"visible\":true,\"common\":false},{\"from\":\"source:Accounts:fields\",\"to\":\"source:Accounts:productLi:\",\"fromPort\":\"source:Accounts:fields\",\"toPort\":\"source:Accounts:productLi:\",\"visible\":true,\"common\":false},{\"from\":\"source:Accounts:fields\",\"to\":\"source:Accounts:phone:\",\"fromPort\":\"source:Accounts:fields\",\"toPort\":\"source:Accounts:phone:\",\"visible\":true,\"common\":false},{\"from\":\"source:Accounts:fields\",\"to\":\"source:Accounts:accountSubType:\",\"fromPort\":\"source:Accounts:fields\",\"toPort\":\"source:Accounts:accountSubType:\",\"visible\":true,\"common\":false},{\"from\":\"source:Accounts:fields\",\"to\":\"source:Accounts:description:\",\"fromPort\":\"source:Accounts:fields\",\"toPort\":\"source:Accounts:description:\",\"visible\":true,\"common\":false},{\"from\":\"source:Accounts:fields\",\"to\":\"source:Accounts:schemeName:\",\"fromPort\":\"source:Accounts:fields\",\"toPort\":\"source:Accounts:schemeName:\",\"visible\":true,\"common\":false},{\"from\":\"source:Accounts:fields\",\"to\":\"source:Accounts:identification:\",\"fromPort\":\"source:Accounts:fields\",\"toPort\":\"source:Accounts:identification:\",\"visible\":true,\"common\":false},{\"from\":\"source:Accounts:fields\",\"to\":\"source:Accounts:secondaryIdentification:\",\"fromPort\":\"source:Accounts:fields\",\"toPort\":\"source:Accounts:secondaryIdentification:\",\"visible\":true,\"common\":false},{\"from\":\"source:Accounts:fields\",\"to\":\"source:Accounts:servicerSchemeName:\",\"fromPort\":\"source:Accounts:fields\",\"toPort\":\"source:Accounts:servicerSchemeName:\",\"visible\":true,\"common\":false},{\"from\":\"source:Accounts:fields\",\"to\":\"source:Accounts:servicerIdentification:\",\"fromPort\":\"source:Accounts:fields\",\"toPort\":\"source:Accounts:servicerIdentification:\",\"visible\":true,\"common\":false},{\"from\":\"source:Accounts:fields\",\"to\":\"source:Accounts:dataCreditDebitIndicator:\",\"fromPort\":\"source:Accounts:fields\",\"toPort\":\"source:Accounts:dataCreditDebitIndicator:\",\"visible\":true,\"common\":false},{\"from\":\"source:Accounts:fields\",\"to\":\"source:Accounts:dataType:\",\"fromPort\":\"source:Accounts:fields\",\"toPort\":\"source:Accounts:dataType:\",\"visible\":true,\"common\":false},{\"from\":\"source:Accounts:fields\",\"to\":\"source:Accounts:dataDateTime:\",\"fromPort\":\"source:Accounts:fields\",\"toPort\":\"source:Accounts:dataDateTime:\",\"visible\":true,\"common\":false},{\"from\":\"source:Accounts:fields\",\"to\":\"source:Accounts:dataCreditLineIncluded:\",\"fromPort\":\"source:Accounts:fields\",\"toPort\":\"source:Accounts:dataCreditLineIncluded:\",\"visible\":true,\"common\":false},{\"from\":\"source:Accounts:fields\",\"to\":\"source:Accounts:dataCreditLineType:\",\"fromPort\":\"source:Accounts:fields\",\"toPort\":\"source:Accounts:dataCreditLineType:\",\"visible\":true,\"common\":false},{\"from\":\"source:Accounts:fields\",\"to\":\"source:Accounts:dataCreditLineAmount:\",\"fromPort\":\"source:Accounts:fields\",\"toPort\":\"source:Accounts:dataCreditLineAmount:\",\"visible\":true,\"common\":false},{\"from\":\"source:Accounts:fields\",\"to\":\"source:Accounts:dataCreditLineCurrency:\",\"fromPort\":\"source:Accounts:fields\",\"toPort\":\"source:Accounts:dataCreditLineCurrency:\",\"visible\":true,\"common\":false},{\"from\":\"source:Accounts:fields\",\"to\":\"source:Accounts:IBAN:\",\"fromPort\":\"source:Accounts:fields\",\"toPort\":\"source:Accounts:IBAN:\",\"visible\":true,\"common\":false},{\"from\":\"source:Accounts:fields\",\"to\":\"source:Accounts:displayName:\",\"fromPort\":\"source:Accounts:fields\",\"toPort\":\"source:Accounts:displayName:\",\"visible\":true,\"common\":false},{\"from\":\"source:Accounts:fields\",\"to\":\"source:Accounts:Account_id:\",\"fromPort\":\"source:Accounts:fields\",\"toPort\":\"source:Accounts:Account_id:\",\"visible\":true,\"common\":false},{\"from\":\"source:Accounts:fields\",\"to\":\"source:Accounts:Organization_Id:\",\"fromPort\":\"source:Accounts:fields\",\"toPort\":\"source:Accounts:Organization_Id:\",\"visible\":true,\"common\":false},{\"from\":\"source:Accounts:fields\",\"to\":\"source:Accounts:Account_Type:\",\"fromPort\":\"source:Accounts:fields\",\"toPort\":\"source:Accounts:Account_Type:\",\"visible\":true,\"common\":false},{\"from\":\"source:Accounts:fields\",\"to\":\"source:Accounts:Customer_id:\",\"fromPort\":\"source:Accounts:fields\",\"toPort\":\"source:Accounts:Customer_id:\",\"visible\":true,\"common\":false},{\"from\":\"source:Accounts:fields\",\"to\":\"source:Accounts:Membership_id:\",\"fromPort\":\"source:Accounts:fields\",\"toPort\":\"source:Accounts:Membership_id:\",\"visible\":true,\"common\":false},{\"from\":\"source:Accounts:fields\",\"to\":\"source:Accounts:Taxid:\",\"fromPort\":\"source:Accounts:fields\",\"toPort\":\"source:Accounts:Taxid:\",\"visible\":true,\"common\":false},{\"from\":\"source:Accounts:fields\",\"to\":\"source:Accounts:CustomerType:\",\"fromPort\":\"source:Accounts:fields\",\"toPort\":\"source:Accounts:CustomerType:\",\"visible\":true,\"common\":false},{\"from\":\"source:Accounts:fields\",\"to\":\"source:Accounts:Ssn:\",\"fromPort\":\"source:Accounts:fields\",\"toPort\":\"source:Accounts:Ssn:\",\"visible\":true,\"common\":false},{\"from\":\"source:Accounts:fields\",\"to\":\"source:Accounts:Status:\",\"fromPort\":\"source:Accounts:fields\",\"toPort\":\"source:Accounts:Status:\",\"visible\":true,\"common\":false},{\"from\":\"source:Accounts:fields\",\"to\":\"source:Accounts:searchString:\",\"fromPort\":\"source:Accounts:fields\",\"toPort\":\"source:Accounts:searchString:\",\"visible\":true,\"common\":false},{\"from\":\"source:Accounts:fields\",\"to\":\"source:Accounts:Ownership:\",\"fromPort\":\"source:Accounts:fields\",\"toPort\":\"source:Accounts:Ownership:\",\"visible\":true,\"common\":false},{\"from\":\"source:Accounts:fields\",\"to\":\"source:Accounts:LastUpdated:\",\"fromPort\":\"source:Accounts:fields\",\"toPort\":\"source:Accounts:LastUpdated:\",\"visible\":true,\"common\":false},{\"from\":\"source:Accounts:fields\",\"to\":\"source:Accounts:ActualUpdatedBY:\",\"fromPort\":\"source:Accounts:fields\",\"toPort\":\"source:Accounts:ActualUpdatedBY:\",\"visible\":true,\"common\":false},{\"from\":\"source:Accounts:fields\",\"to\":\"source:Accounts:UpdatedBy:\",\"fromPort\":\"source:Accounts:fields\",\"toPort\":\"source:Accounts:UpdatedBy:\",\"visible\":true,\"common\":false},{\"from\":\"source:Accounts:fields\",\"to\":\"source:Accounts:userId:\",\"fromPort\":\"source:Accounts:fields\",\"toPort\":\"source:Accounts:userId:\",\"visible\":true,\"common\":false},{\"from\":\"source:Accounts:fields\",\"to\":\"source:Accounts:address:\",\"fromPort\":\"source:Accounts:fields\",\"toPort\":\"source:Accounts:address:\",\"visible\":true,\"common\":false},{\"from\":\"source:Accounts:fields\",\"to\":\"source:Accounts:dateOfBirth:\",\"fromPort\":\"source:Accounts:fields\",\"toPort\":\"source:Accounts:dateOfBirth:\",\"visible\":true,\"common\":false},{\"from\":\"source:Accounts:fields\",\"to\":\"source:Accounts:firstName:\",\"fromPort\":\"source:Accounts:fields\",\"toPort\":\"source:Accounts:firstName:\",\"visible\":true,\"common\":false},{\"from\":\"source:Accounts:fields\",\"to\":\"source:Accounts:lastName:\",\"fromPort\":\"source:Accounts:fields\",\"toPort\":\"source:Accounts:lastName:\",\"visible\":true,\"common\":false},{\"from\":\"source:Accounts:fields\",\"to\":\"source:Accounts:stateId:\",\"fromPort\":\"source:Accounts:fields\",\"toPort\":\"source:Accounts:stateId:\",\"visible\":true,\"common\":false},{\"from\":\"source:Accounts:fields\",\"to\":\"source:Accounts:productId:\",\"fromPort\":\"source:Accounts:fields\",\"toPort\":\"source:Accounts:productId:\",\"visible\":true,\"common\":false},{\"from\":\"source:Accounts:fields\",\"to\":\"source:Accounts:payingAccount:\",\"fromPort\":\"source:Accounts:fields\",\"toPort\":\"source:Accounts:payingAccount:\",\"visible\":true,\"common\":false},{\"from\":\"source:Accounts:fields\",\"to\":\"source:Accounts:payoutAccount:\",\"fromPort\":\"source:Accounts:fields\",\"toPort\":\"source:Accounts:payoutAccount:\",\"visible\":true,\"common\":false},{\"from\":\"source:Accounts:fields\",\"to\":\"source:Accounts:amount:\",\"fromPort\":\"source:Accounts:fields\",\"toPort\":\"source:Accounts:amount:\",\"visible\":true,\"common\":false},{\"from\":\"source:Accounts:fields\",\"to\":\"source:Accounts:duration:\",\"fromPort\":\"source:Accounts:fields\",\"toPort\":\"source:Accounts:duration:\",\"visible\":true,\"common\":false},{\"from\":\"source:Accounts:fields\",\"to\":\"source:Accounts:isBusinessAccount:\",\"fromPort\":\"source:Accounts:fields\",\"toPort\":\"source:Accounts:isBusinessAccount:\",\"visible\":true,\"common\":false},{\"from\":\"source:Accounts:fields\",\"to\":\"source:Accounts:actions:\",\"fromPort\":\"source:Accounts:fields\",\"toPort\":\"source:Accounts:actions:\",\"visible\":true,\"common\":false},{\"from\":\"source:Accounts:fields\",\"to\":\"source:Accounts:serviceKey:\",\"fromPort\":\"source:Accounts:fields\",\"toPort\":\"source:Accounts:serviceKey:\",\"visible\":true,\"common\":false},{\"from\":\"source:Accounts:fields\",\"to\":\"source:Accounts:membershipId:\",\"fromPort\":\"source:Accounts:fields\",\"toPort\":\"source:Accounts:membershipId:\",\"visible\":true,\"common\":false},{\"from\":\"source:Accounts:fields\",\"to\":\"source:Accounts:companyInformation:\",\"fromPort\":\"source:Accounts:fields\",\"toPort\":\"source:Accounts:companyInformation:\",\"visible\":true,\"common\":false},{\"from\":\"source:Accounts:fields\",\"to\":\"source:Accounts:customerInformation:\",\"fromPort\":\"source:Accounts:fields\",\"toPort\":\"source:Accounts:customerInformation:\",\"visible\":true,\"common\":false},{\"from\":\"source:Accounts:fields\",\"to\":\"source:Accounts:masterServiceKey:\",\"fromPort\":\"source:Accounts:fields\",\"toPort\":\"source:Accounts:masterServiceKey:\",\"visible\":true,\"common\":false},{\"from\":\"source:Accounts:fields\",\"to\":\"source:Accounts:isOrganizationAccount:\",\"fromPort\":\"source:Accounts:fields\",\"toPort\":\"source:Accounts:isOrganizationAccount:\",\"visible\":true,\"common\":false},{\"from\":\"source:Accounts:fields\",\"to\":\"source:Accounts:typeId:\",\"fromPort\":\"source:Accounts:fields\",\"toPort\":\"source:Accounts:typeId:\",\"visible\":true,\"common\":false},{\"from\":\"source:Accounts:fields\",\"to\":\"source:Accounts:MembershipName:\",\"fromPort\":\"source:Accounts:fields\",\"toPort\":\"source:Accounts:MembershipName:\",\"visible\":true,\"common\":false},{\"from\":\"source:Accounts:fields\",\"to\":\"source:Accounts:categoryId:\",\"fromPort\":\"source:Accounts:fields\",\"toPort\":\"source:Accounts:categoryId:\",\"visible\":true,\"common\":false},{\"from\":\"source:Accounts:fields\",\"to\":\"source:Accounts:connectionAlertDays:\",\"fromPort\":\"source:Accounts:fields\",\"toPort\":\"source:Accounts:connectionAlertDays:\",\"visible\":true,\"common\":false},{\"from\":\"source:Accounts:fields\",\"to\":\"source:Accounts:nextPaymentAmount:\",\"fromPort\":\"source:Accounts:fields\",\"toPort\":\"source:Accounts:nextPaymentAmount:\",\"visible\":true,\"common\":false},{\"from\":\"source:Accounts:fields\",\"to\":\"source:Accounts:expiresAt:\",\"fromPort\":\"source:Accounts:fields\",\"toPort\":\"source:Accounts:expiresAt:\",\"visible\":true,\"common\":false},{\"from\":\"source:Accounts:fields\",\"to\":\"source:Accounts:bankCode:\",\"fromPort\":\"source:Accounts:fields\",\"toPort\":\"source:Accounts:bankCode:\",\"visible\":true,\"common\":false},{\"from\":\"source:Accounts:fields\",\"to\":\"source:Accounts:nextPaymentDate:\",\"fromPort\":\"source:Accounts:fields\",\"toPort\":\"source:Accounts:nextPaymentDate:\",\"visible\":true,\"common\":false},{\"from\":\"source:Accounts:fields\",\"to\":\"source:Accounts:arrangementId:\",\"fromPort\":\"source:Accounts:fields\",\"toPort\":\"source:Accounts:arrangementId:\",\"visible\":true,\"common\":false},{\"from\":\"source:Accounts:fields\",\"to\":\"source:Accounts:name:\",\"fromPort\":\"source:Accounts:fields\",\"toPort\":\"source:Accounts:name:\",\"visible\":true,\"common\":false},{\"from\":\"source:Accounts:fields\",\"to\":\"source:Accounts:accountIds:\",\"fromPort\":\"source:Accounts:fields\",\"toPort\":\"source:Accounts:accountIds:\",\"visible\":true,\"common\":false},{\"from\":\"source:Accounts:fields\",\"to\":\"source:Accounts:customerId:\",\"fromPort\":\"source:Accounts:fields\",\"toPort\":\"source:Accounts:customerId:\",\"visible\":true,\"common\":false},{\"from\":\"source:Accounts:fields\",\"to\":\"source:Accounts:id:\",\"fromPort\":\"source:Accounts:fields\",\"toPort\":\"source:Accounts:id:\",\"visible\":true,\"common\":false},{\"from\":\"source:Accounts:fields\",\"to\":\"source:Accounts:dbpErrCode:\",\"fromPort\":\"source:Accounts:fields\",\"toPort\":\"source:Accounts:dbpErrCode:\",\"visible\":true,\"common\":false},{\"from\":\"source:Accounts:fields\",\"to\":\"source:Accounts:dbpErrMsg:\",\"fromPort\":\"source:Accounts:fields\",\"toPort\":\"source:Accounts:dbpErrMsg:\",\"visible\":true,\"common\":false},{\"from\":\"source:Accounts:fields\",\"to\":\"source:Accounts:blockedAmount:\",\"fromPort\":\"source:Accounts:fields\",\"toPort\":\"source:Accounts:blockedAmount:\",\"visible\":true,\"common\":false},{\"from\":\"source:Accounts:fields\",\"to\":\"source:Accounts:futureInstallmentsCount:\",\"fromPort\":\"source:Accounts:fields\",\"toPort\":\"source:Accounts:futureInstallmentsCount:\",\"visible\":true,\"common\":false},{\"from\":\"source:Accounts:fields\",\"to\":\"source:Accounts:overDueInstallmentsCount:\",\"fromPort\":\"source:Accounts:fields\",\"toPort\":\"source:Accounts:overDueInstallmentsCount:\",\"visible\":true,\"common\":false},{\"from\":\"source:Accounts:fields\",\"to\":\"source:Accounts:paidInstallmentsCount:\",\"fromPort\":\"source:Accounts:fields\",\"toPort\":\"source:Accounts:paidInstallmentsCount:\",\"visible\":true,\"common\":false},{\"from\":\"source:Accounts:fields\",\"to\":\"source:Accounts:installmentAmount:\",\"fromPort\":\"source:Accounts:fields\",\"toPort\":\"source:Accounts:installmentAmount:\",\"visible\":true,\"common\":false},{\"from\":\"source:Accounts:fields\",\"to\":\"source:Accounts:rePaymentFrequency:\",\"fromPort\":\"source:Accounts:fields\",\"toPort\":\"source:Accounts:rePaymentFrequency:\",\"visible\":true,\"common\":false},{\"from\":\"source:Accounts:fields\",\"to\":\"source:Accounts:sanctionedAmount:\",\"fromPort\":\"source:Accounts:fields\",\"toPort\":\"source:Accounts:sanctionedAmount:\",\"visible\":true,\"common\":false},{\"from\":\"source:Accounts:fields\",\"to\":\"source:Accounts:customerName:\",\"fromPort\":\"source:Accounts:fields\",\"toPort\":\"source:Accounts:customerName:\",\"visible\":true,\"common\":false},{\"from\":\"source:Accounts:fields\",\"to\":\"source:Accounts:sanctionedDate:\",\"fromPort\":\"source:Accounts:fields\",\"toPort\":\"source:Accounts:sanctionedDate:\",\"visible\":true,\"common\":false},{\"from\":\"target\",\"to\":\"target:parameters\",\"fromPort\":\"target\",\"toPort\":\"target:parameters\",\"visible\":true,\"common\":false},{\"from\":\"target:parameters\",\"to\":\"target:accountID:\",\"fromPort\":\"target:parameters\",\"toPort\":\"target:accountID:\",\"visible\":true,\"common\":false}],\"blockCount\":{\"variableCount\":0},\"variableMap\":{},\"xmlMappingOverride\":true}",
    "applyCommonMapping" : false,
    "applyRequestCommonMapping" : false,
    "applyResponseCommonMapping" : true,
    "backendMeta" : {
      "serviceName" : "dbpNonProductServices",
      "serviceVersion" : "1.0",
      "operationName" : "AccountDetailsForCombinedStatements"
    },
    "relationshipHierarchyMapping" : {
      "children" : [ ],
      "name" : "Accounts",
      "actions" : { },
      "selected" : true
    },
    "requestXmlMappingOverride" : true,
    "responseXmlMappingOverride" : false
  }
}