{
  "serviceType" : "integration",
  "jars" : [ {
    "name" : "loanspayoffapi-services.jar",
    "type" : "servicejar"
  }, {
    "name" : "infinity-authtoken-manager.jar",
    "type" : "servicejar"
  }, {
    "name" : "DBPFramework.jar",
    "type" : "servicejar"
  }, {
    "name" : "infinity-api-commons.jar",
    "type" : "servicejar"
  } ]
}