{
  "type" : "svcdriven",
  "custom" : false,
  "junction" : false,
  "customizable" : false,
  "verbs" : {
    "stopNextPayment" : "stopNextPaymentMapping",
    "getBankDate" : "getBankDateMapping",
    "getPostedUserTransactions" : "getPostedUserTransactionsMapping",
    "getUserScheduledTransactions" : "getUserScheduledTransactionsMapping",
    "makeTrialDeposit" : "makeTrialDepositMapping",
    "getPostedCardlessTransactions" : "getPostedCardlessTransactionsMapping",
    "getPendingCardlessTransactions" : "getPendingCardlessTransactionsMapping",
    "getToExternalAccountTransactions" : "getToExternalAccountTransactionsMapping",
    "revokeStopChequePayments" : "revokeStopChequePaymentsMapping",
    "getScheduledUserTransactions" : "getScheduledUserTransactionsMapping",
    "getUserCompletedBillHistory" : "getUserCompletedBillHistoryMapping",
    "getAccountTransactionByTypeCC" : "getAccountTransactionByTypeCCMapping",
    "getStopCheckPaymentRequestTransactions" : "getStopCheckPaymentRequestTransactionsMapping",
    "getChequeBookRequests" : "getChequeBookRequestsMapping",
    "cancelDirectDebit" : "cancelDirectDebitMapping",
    "getLoanSchedule" : "getLoanScheduleMapping",
    "create" : "createMapping",
    "getPayeeBills" : "getPayeeBillsMapping",
    "getPendingDeposits" : "getPendingDepositsMapping",
    "getPostedTransfersAndP2pTransactions" : "getPostedTransfersAndP2pTransactionsMapping",
    "getAccountPendingTransactions" : "getAccountPendingTransactionsMapping",
    "getUserWiredTransactions" : "getUserWiredTransactionsMapping",
    "getScheduledAccountTransactions" : "getScheduledAccountTransactionsMapping",
    "getSentP2PTransactions" : "getSentP2PTransactionsMapping",
    "downloadfile" : "downloadfileMapping",
    "getUsersScheduledBill" : "getUsersScheduledBillMapping",
    "getExternalAccountTransactions" : "getExternalAccountTransactionsMapping",
    "getRecipientWireTransaction" : "getRecipientWireTransactionMapping",
    "getPendingUserTransactions" : "getPendingUserTransactionsMapping",
    "createStopChequePayments" : "createStopChequePaymentsMapping",
    "createBulkTransfer" : "createBulkTransferMapping",
    "getStopChequePayments" : "getStopChequePaymentsMapping",
    "getDirectDebits" : "getDirectDebitsMapping",
    "createOneTimeTransfer" : "createOneTimeTransferMapping",
    "getAccountTransactionByType" : "getAccountTransactionByTypeMapping",
    "getDisputedTransactions" : "getDisputedTransactionsMapping",
    "cancelScheduledTransactionOccurrence" : "cancelScheduledTransactionOccurrenceMapping",
    "getPostedDeposits" : "getPostedDepositsMapping",
    "createChequeBookRequests" : "createChequeBookRequestsMapping",
    "getReceivedP2PRequest" : "getReceivedP2PRequestMapping",
    "getPayPersonHistory" : "getPayPersonHistoryMapping",
    "getAllTransactionsForAdmin" : "getAllTransactionsForAdminMapping",
    "deleteTransaction" : "deleteTransactionMapping",
    "partialupdate" : "partialupdateMapping",
    "delete" : "deleteMapping",
    "verifyTrialDeposit" : "verifyTrialDepositMapping",
    "createCardlessTransaction" : "createCardlessTransactionMapping",
    "createTransfer" : "createTransferMapping",
    "getScheduledTransferAndP2pTransactions" : "getScheduledTransferAndP2pTransactionsMapping",
    "get" : "getMapping",
    "getBlockedFunds" : "getBlockedFundsMapping",
    "getAccountPendingTransactionsPreview" : "getAccountPendingTransactionsPreviewMapping",
    "getAccountPostedTransactionsPreview" : "getAccountPostedTransactionsPreviewMapping",
    "createDisputedTransaction" : "createDisputedTransactionMapping",
    "getAccountPostedTransactions" : "getAccountPostedTransactionsMapping",
    "getRecentAccountTransactions" : "getRecentAccountTransactionsMapping",
    "downloadTransactions" : "downloadTransactionsMapping",
    "isSecondFactorAuthenticationRequired" : "isSecondFactorAuthenticationRequiredMapping",
    "createBulkBillPay" : "createBulkBillPayMapping",
    "getRecentUserTransactions" : "getRecentUserTransactionsMapping",
    "createCreditCardTransfer" : "createCreditCardTransferMapping",
    "getReceivedP2PTransactions" : "getReceivedP2PTransactionsMapping",
    "getAllP2PRequestMoneyForUser" : "getAllP2PRequestMoneyForUserMapping"
  },
  "entityProperties" : {
    "BatchMode" : "buffer",
    "backendMeta" : { },
    "designTimeBackendMeta" : { }
  }
}