{
  "customCode" : {
    "requestProcessorName" : "com.kony.transaction.preprocessors.EditExternalAccountPreProcessor",
    "responseProcessorName" : "com.kony.postprocessors.EditExternalRecipientObjectServicePostProcessor"
  },
  "operationConfig" : {
    "name" : "editExternalAccount5089",
    "type" : "MappedToBackend",
    "cachable" : false,
    "smsEnabled" : false,
    "security" : "authorized_app_user",
    "responseEncoding" : "UTF-8",
    "httpMethod" : "GET",
    "decodeResponseBody" : false,
    "iMapping" : "<?xml version=\"1.0\" encoding=\"UTF-8\" standalone=\"yes\"?><mapper xmlns=\"http://www.kony.com/ns/mapper\">        <map inputpath=\"request_in\" outputpath=\"request_out\">                <set-param inputpath=\"notes\" outputpath=\"notes\"/>                <set-param inputpath=\"isVerified\" outputpath=\"isVerified\"/>                <set-param inputpath=\"nickName\" outputpath=\"nickName\"/>                <set-param inputpath=\"accountType\" outputpath=\"accountType\"/>                <set-param inputpath=\"swiftCode\" outputpath=\"swiftCode\"/>                <set-param inputpath=\"bankName\" outputpath=\"bankName\"/>                <set-param inputpath=\"accountNumber\" outputpath=\"accountNumber\"/>                <set-param inputpath=\"sortCode\" outputpath=\"sortCode\"/>                <set-param inputpath=\"routingNumber\" outputpath=\"routingNumber\"/>                <set-param inputpath=\"isInternationalAccount\" outputpath=\"isInternationalAccount\"/>                <set-param inputpath=\"beneficiaryName\" outputpath=\"beneficiaryName\"/>                <set-param inputpath=\"IBAN\" outputpath=\"IBAN\"/>                <set-param inputpath=\"isSameBankAccount\" outputpath=\"isSameBankAccount\"/>                <set-param inputpath=\"countryName\" outputpath=\"countryName\"/>                   <set-param inputpath=\"phoneCountryCode\" outputpath=\"phoneCountryCode\"/>                      <set-param inputpath=\"phoneNumber\" outputpath=\"phoneNumber\"/>                      <set-param inputpath=\"phoneExtension\" outputpath=\"phoneExtension\"/>      <set-param inputpath=\"beneficiaryId\" outputpath=\"beneficiaryId\"/>  </map></mapper>",
    "iVisualMappingData" : "{\"nodeDataArray\":[{\"isGroup\":true,\"key\":\"request_in\",\"text\":\"ExternalAccounts\",\"xy\":\"150 100\",\"__gohashid\":70505},{\"isGroup\":true,\"key\":\"request_out\",\"text\":\"dbpNonProductServices (1.0).editExternalAccount\",\"xy\":\"770 100\",\"__gohashid\":70506}],\"linkDataArray\":[{\"from\":\"source\",\"to\":\"source:ExternalAccounts\",\"fromPort\":\"source\",\"toPort\":\"source:ExternalAccounts\",\"visible\":true,\"common\":false,\"__gohashid\":725},{\"from\":\"source:ExternalAccounts\",\"to\":\"source:ExternalAccounts:fields\",\"fromPort\":\"source:ExternalAccounts\",\"toPort\":\"source:ExternalAccounts:fields\",\"visible\":true,\"common\":false,\"__gohashid\":726},{\"from\":\"source:ExternalAccounts:fields\",\"to\":\"source:ExternalAccounts:accountNumber:\",\"fromPort\":\"source:ExternalAccounts:fields\",\"toPort\":\"source:ExternalAccounts:accountNumber:\",\"visible\":true,\"common\":false,\"__gohashid\":727},{\"from\":\"source:ExternalAccounts:fields\",\"to\":\"source:ExternalAccounts:accountType:\",\"fromPort\":\"source:ExternalAccounts:fields\",\"toPort\":\"source:ExternalAccounts:accountType:\",\"visible\":true,\"common\":false,\"__gohashid\":728},{\"from\":\"source:ExternalAccounts:fields\",\"to\":\"source:ExternalAccounts:bankName:\",\"fromPort\":\"source:ExternalAccounts:fields\",\"toPort\":\"source:ExternalAccounts:bankName:\",\"visible\":true,\"common\":false,\"__gohashid\":729},{\"from\":\"source:ExternalAccounts:fields\",\"to\":\"source:ExternalAccounts:beneficiaryName:\",\"fromPort\":\"source:ExternalAccounts:fields\",\"toPort\":\"source:ExternalAccounts:beneficiaryName:\",\"visible\":true,\"common\":false,\"__gohashid\":730},{\"from\":\"source:ExternalAccounts:fields\",\"to\":\"source:ExternalAccounts:countryName:\",\"fromPort\":\"source:ExternalAccounts:fields\",\"toPort\":\"source:ExternalAccounts:countryName:\",\"visible\":true,\"common\":false,\"__gohashid\":731},{\"from\":\"source:ExternalAccounts:fields\",\"to\":\"source:ExternalAccounts:createdOn:\",\"fromPort\":\"source:ExternalAccounts:fields\",\"toPort\":\"source:ExternalAccounts:createdOn:\",\"visible\":true,\"common\":false,\"__gohashid\":732},{\"from\":\"source:ExternalAccounts:fields\",\"to\":\"source:ExternalAccounts:errmsg:\",\"fromPort\":\"source:ExternalAccounts:fields\",\"toPort\":\"source:ExternalAccounts:errmsg:\",\"visible\":true,\"common\":false,\"__gohashid\":733},{\"from\":\"source:ExternalAccounts:fields\",\"to\":\"source:ExternalAccounts:firstName:\",\"fromPort\":\"source:ExternalAccounts:fields\",\"toPort\":\"source:ExternalAccounts:firstName:\",\"visible\":true,\"common\":false,\"__gohashid\":734},{\"from\":\"source:ExternalAccounts:fields\",\"to\":\"source:ExternalAccounts:Id:\",\"fromPort\":\"source:ExternalAccounts:fields\",\"toPort\":\"source:ExternalAccounts:Id:\",\"visible\":true,\"common\":false,\"__gohashid\":735},{\"from\":\"source:ExternalAccounts:fields\",\"to\":\"source:ExternalAccounts:isInternationalAccount:\",\"fromPort\":\"source:ExternalAccounts:fields\",\"toPort\":\"source:ExternalAccounts:isInternationalAccount:\",\"visible\":true,\"common\":false,\"__gohashid\":736},{\"from\":\"source:ExternalAccounts:fields\",\"to\":\"source:ExternalAccounts:isSameBankAccount:\",\"fromPort\":\"source:ExternalAccounts:fields\",\"toPort\":\"source:ExternalAccounts:isSameBankAccount:\",\"visible\":true,\"common\":false,\"__gohashid\":737},{\"from\":\"source:ExternalAccounts:fields\",\"to\":\"source:ExternalAccounts:isVerified:\",\"fromPort\":\"source:ExternalAccounts:fields\",\"toPort\":\"source:ExternalAccounts:isVerified:\",\"visible\":true,\"common\":false,\"__gohashid\":738},{\"from\":\"source:ExternalAccounts:fields\",\"to\":\"source:ExternalAccounts:lastName:\",\"fromPort\":\"source:ExternalAccounts:fields\",\"toPort\":\"source:ExternalAccounts:lastName:\",\"visible\":true,\"common\":false,\"__gohashid\":739},{\"from\":\"source:ExternalAccounts:fields\",\"to\":\"source:ExternalAccounts:limit:\",\"fromPort\":\"source:ExternalAccounts:fields\",\"toPort\":\"source:ExternalAccounts:limit:\",\"visible\":true,\"common\":false,\"__gohashid\":740},{\"from\":\"source:ExternalAccounts:fields\",\"to\":\"source:ExternalAccounts:nickName:\",\"fromPort\":\"source:ExternalAccounts:fields\",\"toPort\":\"source:ExternalAccounts:nickName:\",\"visible\":true,\"common\":false,\"__gohashid\":741},{\"from\":\"source:ExternalAccounts:fields\",\"to\":\"source:ExternalAccounts:notes:\",\"fromPort\":\"source:ExternalAccounts:fields\",\"toPort\":\"source:ExternalAccounts:notes:\",\"visible\":true,\"common\":false,\"__gohashid\":742},{\"from\":\"source:ExternalAccounts:fields\",\"to\":\"source:ExternalAccounts:offset:\",\"fromPort\":\"source:ExternalAccounts:fields\",\"toPort\":\"source:ExternalAccounts:offset:\",\"visible\":true,\"common\":false,\"__gohashid\":743},{\"from\":\"source:ExternalAccounts:fields\",\"to\":\"source:ExternalAccounts:order:\",\"fromPort\":\"source:ExternalAccounts:fields\",\"toPort\":\"source:ExternalAccounts:order:\",\"visible\":true,\"common\":false,\"__gohashid\":744},{\"from\":\"source:ExternalAccounts:fields\",\"to\":\"source:ExternalAccounts:routingNumber:\",\"fromPort\":\"source:ExternalAccounts:fields\",\"toPort\":\"source:ExternalAccounts:routingNumber:\",\"visible\":true,\"common\":false,\"__gohashid\":745},{\"from\":\"source:ExternalAccounts:fields\",\"to\":\"source:ExternalAccounts:searchString:\",\"fromPort\":\"source:ExternalAccounts:fields\",\"toPort\":\"source:ExternalAccounts:searchString:\",\"visible\":true,\"common\":false,\"__gohashid\":746},{\"from\":\"source:ExternalAccounts:fields\",\"to\":\"source:ExternalAccounts:sortBy:\",\"fromPort\":\"source:ExternalAccounts:fields\",\"toPort\":\"source:ExternalAccounts:sortBy:\",\"visible\":true,\"common\":false,\"__gohashid\":747},{\"from\":\"source:ExternalAccounts:fields\",\"to\":\"source:ExternalAccounts:success:\",\"fromPort\":\"source:ExternalAccounts:fields\",\"toPort\":\"source:ExternalAccounts:success:\",\"visible\":true,\"common\":false,\"__gohashid\":748},{\"from\":\"source:ExternalAccounts:fields\",\"to\":\"source:ExternalAccounts:swiftCode:\",\"fromPort\":\"source:ExternalAccounts:fields\",\"toPort\":\"source:ExternalAccounts:swiftCode:\",\"visible\":true,\"common\":false,\"__gohashid\":749},{\"from\":\"source:ExternalAccounts:fields\",\"to\":\"source:ExternalAccounts:IBAN:\",\"fromPort\":\"source:ExternalAccounts:fields\",\"toPort\":\"source:ExternalAccounts:IBAN:\",\"visible\":true,\"common\":false,\"__gohashid\":750},{\"from\":\"source:ExternalAccounts:fields\",\"to\":\"source:ExternalAccounts:sortCode:\",\"fromPort\":\"source:ExternalAccounts:fields\",\"toPort\":\"source:ExternalAccounts:sortCode:\",\"visible\":true,\"common\":false,\"__gohashid\":751},{\"from\":\"source:ExternalAccounts:fields\",\"to\":\"source:ExternalAccounts:phoneExtension:\",\"fromPort\":\"source:ExternalAccounts:fields\",\"toPort\":\"source:ExternalAccounts:phoneExtension:\",\"visible\":true,\"common\":false,\"__gohashid\":752},{\"from\":\"source:ExternalAccounts:fields\",\"to\":\"source:ExternalAccounts:phoneNumber:\",\"fromPort\":\"source:ExternalAccounts:fields\",\"toPort\":\"source:ExternalAccounts:phoneNumber:\",\"visible\":true,\"common\":false,\"__gohashid\":753},{\"from\":\"source:ExternalAccounts:fields\",\"to\":\"source:ExternalAccounts:phoneCountryCode:\",\"fromPort\":\"source:ExternalAccounts:fields\",\"toPort\":\"source:ExternalAccounts:phoneCountryCode:\",\"visible\":true,\"common\":false,\"__gohashid\":754},{\"from\":\"target\",\"to\":\"target:parameters\",\"fromPort\":\"target\",\"toPort\":\"target:parameters\",\"visible\":true,\"common\":false,\"__gohashid\":755},{\"from\":\"target:parameters\",\"to\":\"target:accountNumber:\",\"fromPort\":\"target:parameters\",\"toPort\":\"target:accountNumber:\",\"visible\":true,\"common\":false,\"__gohashid\":756},{\"from\":\"target:parameters\",\"to\":\"target:accountType:\",\"fromPort\":\"target:parameters\",\"toPort\":\"target:accountType:\",\"visible\":true,\"common\":false,\"__gohashid\":757},{\"from\":\"target:parameters\",\"to\":\"target:bankName:\",\"fromPort\":\"target:parameters\",\"toPort\":\"target:bankName:\",\"visible\":true,\"common\":false,\"__gohashid\":758},{\"from\":\"target:parameters\",\"to\":\"target:beneficiaryName:\",\"fromPort\":\"target:parameters\",\"toPort\":\"target:beneficiaryName:\",\"visible\":true,\"common\":false,\"__gohashid\":759},{\"from\":\"target:parameters\",\"to\":\"target:countryName:\",\"fromPort\":\"target:parameters\",\"toPort\":\"target:countryName:\",\"visible\":true,\"common\":false,\"__gohashid\":760},{\"from\":\"target:parameters\",\"to\":\"target:IBAN:\",\"fromPort\":\"target:parameters\",\"toPort\":\"target:IBAN:\",\"visible\":true,\"common\":false,\"__gohashid\":761},{\"from\":\"target:parameters\",\"to\":\"target:isInternationalAccount:\",\"fromPort\":\"target:parameters\",\"toPort\":\"target:isInternationalAccount:\",\"visible\":true,\"common\":false,\"__gohashid\":762},{\"from\":\"target:parameters\",\"to\":\"target:isSameBankAccount:\",\"fromPort\":\"target:parameters\",\"toPort\":\"target:isSameBankAccount:\",\"visible\":true,\"common\":false,\"__gohashid\":763},{\"from\":\"target:parameters\",\"to\":\"target:isVerified:\",\"fromPort\":\"target:parameters\",\"toPort\":\"target:isVerified:\",\"visible\":true,\"common\":false,\"__gohashid\":764},{\"from\":\"target:parameters\",\"to\":\"target:nickName:\",\"fromPort\":\"target:parameters\",\"toPort\":\"target:nickName:\",\"visible\":true,\"common\":false,\"__gohashid\":765},{\"from\":\"target:parameters\",\"to\":\"target:notes:\",\"fromPort\":\"target:parameters\",\"toPort\":\"target:notes:\",\"visible\":true,\"common\":false,\"__gohashid\":766},{\"from\":\"target:parameters\",\"to\":\"target:phoneCountryCode:\",\"fromPort\":\"target:parameters\",\"toPort\":\"target:phoneCountryCode:\",\"visible\":true,\"common\":false,\"__gohashid\":767},{\"from\":\"target:parameters\",\"to\":\"target:phoneExtension:\",\"fromPort\":\"target:parameters\",\"toPort\":\"target:phoneExtension:\",\"visible\":true,\"common\":false,\"__gohashid\":768},{\"from\":\"target:parameters\",\"to\":\"target:phoneNumber:\",\"fromPort\":\"target:parameters\",\"toPort\":\"target:phoneNumber:\",\"visible\":true,\"common\":false,\"__gohashid\":769},{\"from\":\"target:parameters\",\"to\":\"target:routingNumber:\",\"fromPort\":\"target:parameters\",\"toPort\":\"target:routingNumber:\",\"visible\":true,\"common\":false,\"__gohashid\":770},{\"from\":\"target:parameters\",\"to\":\"target:sortCode:\",\"fromPort\":\"target:parameters\",\"toPort\":\"target:sortCode:\",\"visible\":true,\"common\":false,\"__gohashid\":771},{\"from\":\"target:parameters\",\"to\":\"target:swiftCode:\",\"fromPort\":\"target:parameters\",\"toPort\":\"target:swiftCode:\",\"visible\":true,\"common\":false,\"__gohashid\":772}],\"blockCount\":{\"variableCount\":0},\"variableMap\":{},\"xmlMappingOverride\":true}",
    "applyCommonMapping" : false,
    "applyRequestCommonMapping" : false,
    "applyResponseCommonMapping" : true,
    "backendMeta" : {
      "serviceName" : "dbpNonProductServices",
      "serviceVersion" : "1.0",
      "operationName" : "editExternalAccount"
    },
    "relationshipHierarchyMapping" : {
      "children" : [ ],
      "name" : "ExternalAccounts",
      "actions" : { },
      "selected" : true
    },
    "requestXmlMappingOverride" : true,
    "responseXmlMappingOverride" : false
  }
}