%YAML 1.1
%TAG !u! tag:unity3d.com,2011:
--- !u!114 &11400000
MonoBehaviour:
  m_ObjectHideFlags: 0
  m_CorrespondingSourceObject: {fileID: 0}
  m_PrefabInstance: {fileID: 0}
  m_PrefabAsset: {fileID: 0}
  m_GameObject: {fileID: 0}
  m_Enabled: 1
  m_EditorHideFlags: 0
  m_Script: {fileID: 11500000, guid: 4f6ebfd023ed43659aa2696d9afb72fd, type: 3}
  m_Name: Base Agent Settings
  m_EditorClassIdentifier: 
  _startHealthPoints: 3
  _spawnDuration: 0.25
  _spawnAnimationCurve:
    serializedVersion: 2
    m_Curve:
    - serializedVersion: 3
      time: 0
      value: 0
      inSlope: 7.309381
      outSlope: 7.309381
      tangentMode: 0
      weightedMode: 0
      inWeight: 0
      outWeight: 0.056005273
    - serializedVersion: 3
      time: 0.4
      value: 1.2
      inSlope: 0
      outSlope: 0
      tangentMode: 136
      weightedMode: 0
      inWeight: 0.33333334
      outWeight: 0.33333334
    - serializedVersion: 3
      time: 0.8238214
      value: 0.96638995
      inSlope: 0
      outSlope: 0
      tangentMode: 136
      weightedMode: 0
      inWeight: 0.33333334
      outWeight: 0.33333334
    - serializedVersion: 3
      time: 1
      value: 1
      inSlope: 0
      outSlope: 0
      tangentMode: 0
      weightedMode: 0
      inWeight: 0
      outWeight: 0
    m_PreInfinity: 2
    m_PostInfinity: 2
    m_RotationOrder: 4
  _dyingDuration: 0.1
  _dyingAnimationCurve:
    serializedVersion: 2
    m_Curve:
    - serializedVersion: 3
      time: 0
      value: 0
      inSlope: 0
      outSlope: 0
      tangentMode: 0
      weightedMode: 0
      inWeight: 0
      outWeight: 0
    - serializedVersion: 3
      time: 1
      value: 0.25
      inSlope: 0
      outSlope: 0
      tangentMode: 0
      weightedMode: 0
      inWeight: 0
      outWeight: 0
    m_PreInfinity: 2
    m_PostInfinity: 2
    m_RotationOrder: 4
  _movementRotationStep: 0.05
  _movementMaxRotationSpeed: 2.5
  _movementStoppingRotationAngle: 20
  _movementAccelerationStep: 0.0008
  _movementMaxMagnitude: 3
  _movementDecelerationDistance: 0.6
  _waitTimeMin: 1
  _waitTimeMax: 3
  _struckMinDuration: 1
  _struckMaxDuration: 2
  _struckFallbackVelocity: 5
  _struckFallbackDuration: 0.3
  _onStruckDontTakeDamageFor: 2
  <Debug>k__BackingField: 0
