%YAML 1.1
%TAG !u! tag:unity3d.com,2011:
--- !u!114 &11400000
MonoBehaviour:
  m_ObjectHideFlags: 0
  m_CorrespondingSourceObject: {fileID: 0}
  m_PrefabInstance: {fileID: 0}
  m_PrefabAsset: {fileID: 0}
  m_GameObject: {fileID: 0}
  m_Enabled: 1
  m_EditorHideFlags: 0
  m_Script: {fileID: 11500000, guid: b609b25417cb418ba5ab0bdd0dd40eb2, type: 3}
  m_Name: Default Game Settings
  m_EditorClassIdentifier: 
  <EnemyPrefab>k__BackingField: {fileID: 8502575811490391172, guid: 2b498200ca38a3f40b1f519fd5e6bb5f, type: 3}
  <EnemySpeed>k__BackingField: 2
  <EnemiesPerSpawnStep>k__BackingField:
    _items:
    - <Value>k__BackingField: 2
      <Range>k__BackingField: 100
    - <Value>k__BackingField: 3
      <Range>k__BackingField: 20
    - <Value>k__BackingField: 4
      <Range>k__BackingField: 5
    - <Value>k__BackingField: 5
      <Range>k__BackingField: 2
  <EnemiesSpawnStepInSeconds>k__BackingField: 1
  <EnemiesOffScreenOffset>k__BackingField: 1
  <DistanceBetweenLines>k__BackingField: 1.5
  <EnemiesTextures>k__BackingField:
  - {fileID: 2800000, guid: 23902c92dd65cd74a9a49314845bbe8b, type: 3}
  - {fileID: 2800000, guid: 9069eae51df138a4aa0c06de5bb5c79f, type: 3}
  <PlayerPrefab>k__BackingField: {fileID: 4811192913787428819, guid: 4d46aa3a25c59be439e3b741cfde1adf, type: 3}
  <PlayerTargetPositionFromEdgeOffset>k__BackingField: 2
  <PlayerMovementSpeed>k__BackingField: 6
  <PlayerFollowUpMultiplier>k__BackingField: 0.1
  <MaxHeight>k__BackingField: 4
  <MaxHealthPoints>k__BackingField: 5
  <PlayerTexture>k__BackingField: {fileID: 2800000, guid: 5306138cfd9311043a7a12aee1b6519e, type: 3}
  <BulletPrefab>k__BackingField: {fileID: 7332527483083886337, guid: 836a5c7a3e2b67841921a5d06d89a90d, type: 3}
  <BulletsSpawnStepInSeconds>k__BackingField: 0.2
  <BulletsSpeed>k__BackingField: 6
  <LevelDurationInSeconds>k__BackingField: 20
  <PlaneMaterialReference>k__BackingField: {fileID: 2100000, guid: db6d7c7df6377cd47bcc12b06b6a9506, type: 2}
