<?xml version="1.0" encoding="UTF-8"?>
<svg width="350px" height="311px" viewBox="0 0 350 311" version="1.1" xmlns="http://www.w3.org/2000/svg" xmlns:xlink="http://www.w3.org/1999/xlink">
    <!-- Generator: Sketch 49 (51002) - http://www.bohemiancoding.com/sketch -->
    <title>gifticon</title>
    <desc>Created with Sketch.</desc>
    <defs></defs>
    <g id="Page-1" stroke="none" stroke-width="1" fill="none" fill-rule="evenodd">
        <g id="gifticon" transform="translate(0.000000, -19.000000)">
            <g id="Group" transform="translate(0.000000, 19.000000)" fill="#FFFFFF" fill-rule="nonzero">
                <path d="M99.4318182,0.439550886 C71.6661034,0.439550886 51.7045455,23.3799934 51.7045455,48.1357534 C51.7045455,59.7676767 56.1596358,71.2011282 63.7606534,79.9332218 L7.95454545,79.9332218 C7.70614807,79.9215759 7.4572042,79.9215759 7.20880682,79.9332218 C3.29848074,80.3015199 -0.0169360227,83.9575292 8.83123327e-16,87.8825889 L8.83123327e-16,143.528158 C0.000416022727,147.690324 3.78966875,151.477108 7.95454545,151.477526 L19.8863636,151.477526 L19.8863636,302.5155 C19.8867812,306.677666 23.6760324,310.46445 27.8409091,310.464867 L322.159091,310.464867 C326.323968,310.46445 330.113219,306.677666 330.113636,302.5155 L330.113636,151.477526 L342.045455,151.477526 C346.210331,151.477108 349.999582,147.690324 350,143.528158 L350,87.8825889 C349.999582,83.7204235 346.210331,79.9336391 342.045455,79.9332218 L286.239347,79.9332218 C293.840364,71.2011282 298.295455,59.7676767 298.295455,48.1357534 C298.295455,23.3799934 278.333897,0.439550886 250.568182,0.439550886 C229.129123,0.439550886 213.419723,15.0496529 201.100852,31.8643927 C191.360627,45.1593911 183.117148,60.4228596 175,73.474361 C166.882852,60.4228596 158.639373,45.1593911 148.899148,31.8643927 C136.580277,15.0496529 120.870877,0.439550886 99.4318182,0.439550886 Z M99.4318182,16.3382851 C113.622433,16.3382851 124.942539,25.9542767 136.097301,41.1800572 C144.548874,52.7160992 152.515276,66.7224866 160.706676,79.9332218 L98.3132102,79.9332218 C80.6500188,79.9332218 67.6136364,63.879157 67.6136364,48.1357534 C67.6136364,31.8188825 80.3747,16.3382851 99.4318182,16.3382851 Z M250.568182,16.3382851 C269.6253,16.3382851 282.386364,31.8188825 282.386364,48.1357534 C282.386364,63.879157 269.349981,79.9332218 251.68679,79.9332218 L189.293324,79.9332218 C197.484724,66.7224866 205.451126,52.7160992 213.902699,41.1800572 C225.057461,25.9542767 236.377567,16.3382851 250.568182,16.3382851 Z M15.9090909,95.8319559 L139.204545,95.8319559 L139.204545,135.578791 L15.9090909,135.578791 L15.9090909,95.8319559 Z M155.113636,95.8319559 L194.886364,95.8319559 L194.886364,294.566133 L155.113636,294.566133 L155.113636,95.8319559 Z M210.795455,95.8319559 L334.090909,95.8319559 L334.090909,135.578791 L210.795455,135.578791 L210.795455,95.8319559 Z M35.7954545,151.477526 L139.204545,151.477526 L139.204545,294.566133 L35.7954545,294.566133 L35.7954545,151.477526 Z M210.795455,151.477526 L314.204545,151.477526 L314.204545,294.566133 L210.795455,294.566133 L210.795455,151.477526 Z" id="Shape"></path>
            </g>
            <rect id="Frame" stroke-opacity="0" stroke="#979797" x="0.5" y="0.5" width="349" height="349"></rect>
        </g>
    </g>
</svg>