%TF.GenerationSoftware,KiCad,Pcbnew,6.0.11-2627ca5db0~126~ubuntu22.04.1*%
%TF.CreationDate,2023-02-08T20:54:58-08:00*%
%TF.ProjectId,ventbot,76656e74-626f-4742-9e6b-696361645f70,v2023-02-14*%
%TF.SameCoordinates,Original*%
%TF.FileFunction,Profile,NP*%
%FSLAX46Y46*%
G04 Gerber Fmt 4.6, Leading zero omitted, Abs format (unit mm)*
G04 Created by KiCad (PCBNEW 6.0.11-2627ca5db0~126~ubuntu22.04.1) date 2023-02-08 20:54:58*
%MOMM*%
%LPD*%
G01*
G04 APERTURE LIST*
%TA.AperFunction,Profile*%
%ADD10C,0.100000*%
%TD*%
G04 APERTURE END LIST*
D10*
X124421000Y-45062000D02*
X195421000Y-45062000D01*
X195421000Y-45062000D02*
X195421000Y-144062000D01*
X195421000Y-144062000D02*
X124421000Y-144062000D01*
X124421000Y-144062000D02*
X124421000Y-45062000D01*
M02*
