^C:\USERS\KAYLYN\DOCUMENTS\SCHOOL\INT CG\LIL REPO\LINKEDIN-LEARNING\EX_FILES_UAR_OPENGL\EXERCISE FILES\GLFW\TESTS\JOYSTICKS.C
C:\USERS\KAYLYN\DOCUMENTS\SCHOOL\INT CG\LIL REPO\LINKEDIN-LEARNING\EX_FILES_UAR_OPENGL\EXERCISE FILES\VISUALSTUDIO\GLFW\TESTS\JOYSTICKS.DIR\DEBUG\VC142.PDB
C:\USERS\KAYLYN\DOCUMENTS\SCHOOL\INT CG\LIL REPO\LINKEDIN-LEARNING\EX_FILES_UAR_OPENGL\EXERCISE FILES\VISUALSTUDIO\GLFW\TESTS\JOYSTICKS.DIR\DEBUG\JOYSTICKS.OBJ
