^C:\USERS\KAYLYN\DOCUMENTS\SCHOOL\INT CG\LIL REPO\LINKEDIN-LEARNING\EX_FILES_UAR_OPENGL\EXERCISE FILES\GLFW\DEPS\GETOPT.C|C:\USERS\KAYLYN\DOCUMENTS\SCHOOL\INT CG\LIL REPO\LINKEDIN-LEARNING\EX_FILES_UAR_OPENGL\EXERCISE FILES\GLFW\TESTS\CLIPBOARD.C
C:\USERS\KAYLYN\DOCUMENTS\SCHOOL\INT CG\LIL REPO\LINKEDIN-LEARNING\EX_FILES_UAR_OPENGL\EXERCISE FILES\VISUALSTUDIO\GLFW\TESTS\CLIPBOARD.DIR\DEBUG\VC142.PDB
C:\USERS\KAYLYN\DOCUMENTS\SCHOOL\INT CG\LIL REPO\LINKEDIN-LEARNING\EX_FILES_UAR_OPENGL\EXERCISE FILES\VISUALSTUDIO\GLFW\TESTS\CLIPBOARD.DIR\DEBUG\GETOPT.OBJ
C:\USERS\KAYLYN\DOCUMENTS\SCHOOL\INT CG\LIL REPO\LINKEDIN-LEARNING\EX_FILES_UAR_OPENGL\EXERCISE FILES\VISUALSTUDIO\GLFW\TESTS\CLIPBOARD.DIR\DEBUG\CLIPBOARD.OBJ
^C:\USERS\KAYLYN\DOCUMENTS\SCHOOL\INT CG\LIL REPO\LINKEDIN-LEARNING\EX_FILES_UAR_OPENGL\EXERCISE FILES\GLFW\TESTS\CLIPBOARD.C
C:\USERS\KAYLYN\DOCUMENTS\SCHOOL\INT CG\LIL REPO\LINKEDIN-LEARNING\EX_FILES_UAR_OPENGL\EXERCISE FILES\VISUALSTUDIO\GLFW\TESTS\CLIPBOARD.DIR\DEBUG\VC142.PDB
^C:\USERS\KAYLYN\DOCUMENTS\SCHOOL\INT CG\LIL REPO\LINKEDIN-LEARNING\EX_FILES_UAR_OPENGL\EXERCISE FILES\GLFW\DEPS\GETOPT.C
C:\USERS\KAYLYN\DOCUMENTS\SCHOOL\INT CG\LIL REPO\LINKEDIN-LEARNING\EX_FILES_UAR_OPENGL\EXERCISE FILES\VISUALSTUDIO\GLFW\TESTS\CLIPBOARD.DIR\DEBUG\VC142.PDB
