^C:\USERS\KAYLYN\DOCUMENTS\SCHOOL\INT CG\LIL REPO\LINKEDIN-LEARNING\EX_FILES_UAR_OPENGL\EXERCISE FILES\VISUALSTUDIO\GLFW\TESTS\TEARING.DIR\DEBUG\TEARING.OBJ
C:\USERS\KAYLYN\DOCUMENTS\SCHOOL\INT CG\LIL REPO\LINKEDIN-LEARNING\EX_FILES_UAR_OPENGL\EXERCISE FILES\VISUALSTUDIO\BIN\DEBUG\TEARING.ILK
C:\USERS\KAYLYN\DOCUMENTS\SCHOOL\INT CG\LIL REPO\LINKEDIN-LEARNING\EX_FILES_UAR_OPENGL\EXERCISE FILES\VISUALSTUDIO\BIN\DEBUG\TEARING.EXE
C:\USERS\KAYLYN\DOCUMENTS\SCHOOL\INT CG\LIL REPO\LINKEDIN-LEARNING\EX_FILES_UAR_OPENGL\EXERCISE FILES\VISUALSTUDIO\BIN\DEBUG\TEARING.PDB
