^C:\USERS\KAYLYN\DOCUMENTS\SCHOOL\INT CG\LIL REPO\LINKEDIN-LEARNING\EX_FILES_UAR_OPENGL\EXERCISE FILES\EXAMPLES\KEYBOARD.CPP
C:\PROGRAM FILES (X86)\MICROSOFT VISUAL STUDIO\2019\ENTERPRISE\VC\TOOLS\MSVC\14.24.28314\BIN\HOSTX64\X64\1033\CLUI.DLL
C:\WINDOWS\GLOBALIZATION\SORTING\SORTDEFAULT.NLS
C:\WINDOWS\SYSTEM32\TZRES.DLL
C:\USERS\KAYLYN\DOCUMENTS\SCHOOL\INT CG\LIL REPO\LINKEDIN-LEARNING\EX_FILES_UAR_OPENGL\EXERCISE FILES\INCLUDE\GLFW_APP.HPP
C:\USERS\KAYLYN\DOCUMENTS\SCHOOL\INT CG\LIL REPO\LINKEDIN-LEARNING\EX_FILES_UAR_OPENGL\EXERCISE FILES\INCLUDE\GLFW_WINDOW.HPP
C:\USERS\KAYLYN\DOCUMENTS\SCHOOL\INT CG\LIL REPO\LINKEDIN-LEARNING\EX_FILES_UAR_OPENGL\EXERCISE FILES\INCLUDE\GL_LIB.HPP
C:\PROGRAM FILES (X86)\WINDOWS KITS\10\INCLUDE\10.0.18362.0\UCRT\STDLIB.H
C:\PROGRAM FILES (X86)\WINDOWS KITS\10\INCLUDE\10.0.18362.0\UCRT\CORECRT.H
C:\PROGRAM FILES (X86)\MICROSOFT VISUAL STUDIO\2019\ENTERPRISE\VC\TOOLS\MSVC\14.24.28314\INCLUDE\VCRUNTIME.H
C:\PROGRAM FILES (X86)\MICROSOFT VISUAL STUDIO\2019\ENTERPRISE\VC\TOOLS\MSVC\14.24.28314\INCLUDE\SAL.H
C:\PROGRAM FILES (X86)\MICROSOFT VISUAL STUDIO\2019\ENTERPRISE\VC\TOOLS\MSVC\14.24.28314\INCLUDE\CONCURRENCYSAL.H
C:\PROGRAM FILES (X86)\MICROSOFT VISUAL STUDIO\2019\ENTERPRISE\VC\TOOLS\MSVC\14.24.28314\INCLUDE\VADEFS.H
C:\PROGRAM FILES (X86)\WINDOWS KITS\10\INCLUDE\10.0.18362.0\UCRT\CORECRT_MALLOC.H
C:\PROGRAM FILES (X86)\WINDOWS KITS\10\INCLUDE\10.0.18362.0\UCRT\CORECRT_SEARCH.H
C:\PROGRAM FILES (X86)\WINDOWS KITS\10\INCLUDE\10.0.18362.0\UCRT\STDDEF.H
C:\PROGRAM FILES (X86)\WINDOWS KITS\10\INCLUDE\10.0.18362.0\UCRT\CORECRT_WSTDLIB.H
C:\PROGRAM FILES (X86)\MICROSOFT VISUAL STUDIO\2019\ENTERPRISE\VC\TOOLS\MSVC\14.24.28314\INCLUDE\LIMITS.H
C:\USERS\KAYLYN\DOCUMENTS\SCHOOL\INT CG\LIL REPO\LINKEDIN-LEARNING\EX_FILES_UAR_OPENGL\EXERCISE FILES\WIN\GLEW\INCLUDE\GL\GLEW.H
C:\PROGRAM FILES (X86)\WINDOWS KITS\10\INCLUDE\10.0.18362.0\UM\GL\GLU.H
C:\PROGRAM FILES (X86)\WINDOWS KITS\10\INCLUDE\10.0.18362.0\SHARED\WINAPIFAMILY.H
C:\PROGRAM FILES (X86)\WINDOWS KITS\10\INCLUDE\10.0.18362.0\SHARED\WINPACKAGEFAMILY.H
C:\PROGRAM FILES (X86)\WINDOWS KITS\10\INCLUDE\10.0.18362.0\UM\GL\GL.H
C:\USERS\KAYLYN\DOCUMENTS\SCHOOL\INT CG\LIL REPO\LINKEDIN-LEARNING\EX_FILES_UAR_OPENGL\EXERCISE FILES\GLFW\INCLUDE\GLFW\GLFW3.H
C:\PROGRAM FILES (X86)\MICROSOFT VISUAL STUDIO\2019\ENTERPRISE\VC\TOOLS\MSVC\14.24.28314\INCLUDE\IOSTREAM
C:\PROGRAM FILES (X86)\MICROSOFT VISUAL STUDIO\2019\ENTERPRISE\VC\TOOLS\MSVC\14.24.28314\INCLUDE\YVALS_CORE.H
C:\PROGRAM FILES (X86)\MICROSOFT VISUAL STUDIO\2019\ENTERPRISE\VC\TOOLS\MSVC\14.24.28314\INCLUDE\XKEYCHECK.H
C:\PROGRAM FILES (X86)\MICROSOFT VISUAL STUDIO\2019\ENTERPRISE\VC\TOOLS\MSVC\14.24.28314\INCLUDE\ISTREAM
C:\PROGRAM FILES (X86)\MICROSOFT VISUAL STUDIO\2019\ENTERPRISE\VC\TOOLS\MSVC\14.24.28314\INCLUDE\OSTREAM
C:\PROGRAM FILES (X86)\MICROSOFT VISUAL STUDIO\2019\ENTERPRISE\VC\TOOLS\MSVC\14.24.28314\INCLUDE\IOS
C:\PROGRAM FILES (X86)\MICROSOFT VISUAL STUDIO\2019\ENTERPRISE\VC\TOOLS\MSVC\14.24.28314\INCLUDE\XLOCNUM
C:\PROGRAM FILES (X86)\MICROSOFT VISUAL STUDIO\2019\ENTERPRISE\VC\TOOLS\MSVC\14.24.28314\INCLUDE\CLIMITS
C:\PROGRAM FILES (X86)\MICROSOFT VISUAL STUDIO\2019\ENTERPRISE\VC\TOOLS\MSVC\14.24.28314\INCLUDE\CMATH
C:\PROGRAM FILES (X86)\MICROSOFT VISUAL STUDIO\2019\ENTERPRISE\VC\TOOLS\MSVC\14.24.28314\INCLUDE\YVALS.H
C:\PROGRAM FILES (X86)\WINDOWS KITS\10\INCLUDE\10.0.18362.0\UCRT\CRTDBG.H
C:\PROGRAM FILES (X86)\MICROSOFT VISUAL STUDIO\2019\ENTERPRISE\VC\TOOLS\MSVC\14.24.28314\INCLUDE\VCRUNTIME_NEW_DEBUG.H
C:\PROGRAM FILES (X86)\MICROSOFT VISUAL STUDIO\2019\ENTERPRISE\VC\TOOLS\MSVC\14.24.28314\INCLUDE\VCRUNTIME_NEW.H
C:\PROGRAM FILES (X86)\MICROSOFT VISUAL STUDIO\2019\ENTERPRISE\VC\TOOLS\MSVC\14.24.28314\INCLUDE\CRTDEFS.H
C:\PROGRAM FILES (X86)\MICROSOFT VISUAL STUDIO\2019\ENTERPRISE\VC\TOOLS\MSVC\14.24.28314\INCLUDE\USE_ANSI.H
C:\PROGRAM FILES (X86)\MICROSOFT VISUAL STUDIO\2019\ENTERPRISE\VC\TOOLS\MSVC\14.24.28314\INCLUDE\CSTDLIB
C:\PROGRAM FILES (X86)\WINDOWS KITS\10\INCLUDE\10.0.18362.0\UCRT\MATH.H
C:\PROGRAM FILES (X86)\WINDOWS KITS\10\INCLUDE\10.0.18362.0\UCRT\CORECRT_MATH.H
C:\PROGRAM FILES (X86)\MICROSOFT VISUAL STUDIO\2019\ENTERPRISE\VC\TOOLS\MSVC\14.24.28314\INCLUDE\XTGMATH.H
C:\PROGRAM FILES (X86)\MICROSOFT VISUAL STUDIO\2019\ENTERPRISE\VC\TOOLS\MSVC\14.24.28314\INCLUDE\XTR1COMMON
C:\PROGRAM FILES (X86)\MICROSOFT VISUAL STUDIO\2019\ENTERPRISE\VC\TOOLS\MSVC\14.24.28314\INCLUDE\CSTDIO
C:\PROGRAM FILES (X86)\WINDOWS KITS\10\INCLUDE\10.0.18362.0\UCRT\STDIO.H
C:\PROGRAM FILES (X86)\WINDOWS KITS\10\INCLUDE\10.0.18362.0\UCRT\CORECRT_WSTDIO.H
C:\PROGRAM FILES (X86)\WINDOWS KITS\10\INCLUDE\10.0.18362.0\UCRT\CORECRT_STDIO_CONFIG.H
C:\PROGRAM FILES (X86)\MICROSOFT VISUAL STUDIO\2019\ENTERPRISE\VC\TOOLS\MSVC\14.24.28314\INCLUDE\STREAMBUF
C:\PROGRAM FILES (X86)\MICROSOFT VISUAL STUDIO\2019\ENTERPRISE\VC\TOOLS\MSVC\14.24.28314\INCLUDE\XIOSBASE
C:\PROGRAM FILES (X86)\WINDOWS KITS\10\INCLUDE\10.0.18362.0\UCRT\SHARE.H
C:\PROGRAM FILES (X86)\WINDOWS KITS\10\INCLUDE\10.0.18362.0\UCRT\CORECRT_SHARE.H
C:\PROGRAM FILES (X86)\MICROSOFT VISUAL STUDIO\2019\ENTERPRISE\VC\TOOLS\MSVC\14.24.28314\INCLUDE\SYSTEM_ERROR
C:\PROGRAM FILES (X86)\MICROSOFT VISUAL STUDIO\2019\ENTERPRISE\VC\TOOLS\MSVC\14.24.28314\INCLUDE\CERRNO
C:\PROGRAM FILES (X86)\WINDOWS KITS\10\INCLUDE\10.0.18362.0\UCRT\ERRNO.H
C:\PROGRAM FILES (X86)\MICROSOFT VISUAL STUDIO\2019\ENTERPRISE\VC\TOOLS\MSVC\14.24.28314\INCLUDE\STDEXCEPT
C:\PROGRAM FILES (X86)\MICROSOFT VISUAL STUDIO\2019\ENTERPRISE\VC\TOOLS\MSVC\14.24.28314\INCLUDE\EXCEPTION
C:\PROGRAM FILES (X86)\MICROSOFT VISUAL STUDIO\2019\ENTERPRISE\VC\TOOLS\MSVC\14.24.28314\INCLUDE\TYPE_TRAITS
C:\PROGRAM FILES (X86)\MICROSOFT VISUAL STUDIO\2019\ENTERPRISE\VC\TOOLS\MSVC\14.24.28314\INCLUDE\XSTDDEF
C:\PROGRAM FILES (X86)\MICROSOFT VISUAL STUDIO\2019\ENTERPRISE\VC\TOOLS\MSVC\14.24.28314\INCLUDE\CSTDDEF
C:\PROGRAM FILES (X86)\MICROSOFT VISUAL STUDIO\2019\ENTERPRISE\VC\TOOLS\MSVC\14.24.28314\INCLUDE\INITIALIZER_LIST
C:\PROGRAM FILES (X86)\WINDOWS KITS\10\INCLUDE\10.0.18362.0\UCRT\MALLOC.H
C:\PROGRAM FILES (X86)\MICROSOFT VISUAL STUDIO\2019\ENTERPRISE\VC\TOOLS\MSVC\14.24.28314\INCLUDE\VCRUNTIME_EXCEPTION.H
C:\PROGRAM FILES (X86)\MICROSOFT VISUAL STUDIO\2019\ENTERPRISE\VC\TOOLS\MSVC\14.24.28314\INCLUDE\EH.H
C:\PROGRAM FILES (X86)\WINDOWS KITS\10\INCLUDE\10.0.18362.0\UCRT\CORECRT_TERMINATE.H
C:\PROGRAM FILES (X86)\MICROSOFT VISUAL STUDIO\2019\ENTERPRISE\VC\TOOLS\MSVC\14.24.28314\INCLUDE\XSTRING
C:\PROGRAM FILES (X86)\MICROSOFT VISUAL STUDIO\2019\ENTERPRISE\VC\TOOLS\MSVC\14.24.28314\INCLUDE\IOSFWD
C:\PROGRAM FILES (X86)\MICROSOFT VISUAL STUDIO\2019\ENTERPRISE\VC\TOOLS\MSVC\14.24.28314\INCLUDE\CSTRING
C:\PROGRAM FILES (X86)\WINDOWS KITS\10\INCLUDE\10.0.18362.0\UCRT\STRING.H
C:\PROGRAM FILES (X86)\WINDOWS KITS\10\INCLUDE\10.0.18362.0\UCRT\CORECRT_MEMORY.H
C:\PROGRAM FILES (X86)\WINDOWS KITS\10\INCLUDE\10.0.18362.0\UCRT\CORECRT_MEMCPY_S.H
C:\PROGRAM FILES (X86)\MICROSOFT VISUAL STUDIO\2019\ENTERPRISE\VC\TOOLS\MSVC\14.24.28314\INCLUDE\VCRUNTIME_STRING.H
C:\PROGRAM FILES (X86)\WINDOWS KITS\10\INCLUDE\10.0.18362.0\UCRT\CORECRT_WSTRING.H
C:\PROGRAM FILES (X86)\MICROSOFT VISUAL STUDIO\2019\ENTERPRISE\VC\TOOLS\MSVC\14.24.28314\INCLUDE\CWCHAR
C:\PROGRAM FILES (X86)\WINDOWS KITS\10\INCLUDE\10.0.18362.0\UCRT\WCHAR.H
C:\PROGRAM FILES (X86)\WINDOWS KITS\10\INCLUDE\10.0.18362.0\UCRT\CORECRT_WCONIO.H
C:\PROGRAM FILES (X86)\WINDOWS KITS\10\INCLUDE\10.0.18362.0\UCRT\CORECRT_WCTYPE.H
C:\PROGRAM FILES (X86)\WINDOWS KITS\10\INCLUDE\10.0.18362.0\UCRT\CORECRT_WDIRECT.H
C:\PROGRAM FILES (X86)\WINDOWS KITS\10\INCLUDE\10.0.18362.0\UCRT\CORECRT_WIO.H
C:\PROGRAM FILES (X86)\WINDOWS KITS\10\INCLUDE\10.0.18362.0\UCRT\CORECRT_WPROCESS.H
C:\PROGRAM FILES (X86)\WINDOWS KITS\10\INCLUDE\10.0.18362.0\UCRT\CORECRT_WTIME.H
C:\PROGRAM FILES (X86)\WINDOWS KITS\10\INCLUDE\10.0.18362.0\UCRT\SYS\STAT.H
C:\PROGRAM FILES (X86)\WINDOWS KITS\10\INCLUDE\10.0.18362.0\UCRT\SYS\TYPES.H
C:\PROGRAM FILES (X86)\MICROSOFT VISUAL STUDIO\2019\ENTERPRISE\VC\TOOLS\MSVC\14.24.28314\INCLUDE\XMEMORY
C:\PROGRAM FILES (X86)\MICROSOFT VISUAL STUDIO\2019\ENTERPRISE\VC\TOOLS\MSVC\14.24.28314\INCLUDE\CSTDINT
C:\PROGRAM FILES (X86)\MICROSOFT VISUAL STUDIO\2019\ENTERPRISE\VC\TOOLS\MSVC\14.24.28314\INCLUDE\STDINT.H
C:\PROGRAM FILES (X86)\MICROSOFT VISUAL STUDIO\2019\ENTERPRISE\VC\TOOLS\MSVC\14.24.28314\INCLUDE\LIMITS
C:\PROGRAM FILES (X86)\MICROSOFT VISUAL STUDIO\2019\ENTERPRISE\VC\TOOLS\MSVC\14.24.28314\INCLUDE\CFLOAT
C:\PROGRAM FILES (X86)\WINDOWS KITS\10\INCLUDE\10.0.18362.0\UCRT\FLOAT.H
C:\PROGRAM FILES (X86)\MICROSOFT VISUAL STUDIO\2019\ENTERPRISE\VC\TOOLS\MSVC\14.24.28314\INCLUDE\NEW
C:\PROGRAM FILES (X86)\MICROSOFT VISUAL STUDIO\2019\ENTERPRISE\VC\TOOLS\MSVC\14.24.28314\INCLUDE\XATOMIC.H
C:\PROGRAM FILES (X86)\MICROSOFT VISUAL STUDIO\2019\ENTERPRISE\VC\TOOLS\MSVC\14.24.28314\INCLUDE\INTRIN0.H
C:\PROGRAM FILES (X86)\MICROSOFT VISUAL STUDIO\2019\ENTERPRISE\VC\TOOLS\MSVC\14.24.28314\INCLUDE\XUTILITY
C:\PROGRAM FILES (X86)\MICROSOFT VISUAL STUDIO\2019\ENTERPRISE\VC\TOOLS\MSVC\14.24.28314\INCLUDE\UTILITY
C:\PROGRAM FILES (X86)\MICROSOFT VISUAL STUDIO\2019\ENTERPRISE\VC\TOOLS\MSVC\14.24.28314\INCLUDE\XCALL_ONCE.H
C:\PROGRAM FILES (X86)\MICROSOFT VISUAL STUDIO\2019\ENTERPRISE\VC\TOOLS\MSVC\14.24.28314\INCLUDE\XERRC.H
C:\PROGRAM FILES (X86)\MICROSOFT VISUAL STUDIO\2019\ENTERPRISE\VC\TOOLS\MSVC\14.24.28314\INCLUDE\XLOCALE
C:\PROGRAM FILES (X86)\MICROSOFT VISUAL STUDIO\2019\ENTERPRISE\VC\TOOLS\MSVC\14.24.28314\INCLUDE\MEMORY
C:\PROGRAM FILES (X86)\MICROSOFT VISUAL STUDIO\2019\ENTERPRISE\VC\TOOLS\MSVC\14.24.28314\INCLUDE\TYPEINFO
C:\PROGRAM FILES (X86)\MICROSOFT VISUAL STUDIO\2019\ENTERPRISE\VC\TOOLS\MSVC\14.24.28314\INCLUDE\VCRUNTIME_TYPEINFO.H
C:\PROGRAM FILES (X86)\MICROSOFT VISUAL STUDIO\2019\ENTERPRISE\VC\TOOLS\MSVC\14.24.28314\INCLUDE\XFACET
C:\PROGRAM FILES (X86)\MICROSOFT VISUAL STUDIO\2019\ENTERPRISE\VC\TOOLS\MSVC\14.24.28314\INCLUDE\XLOCINFO
C:\PROGRAM FILES (X86)\MICROSOFT VISUAL STUDIO\2019\ENTERPRISE\VC\TOOLS\MSVC\14.24.28314\INCLUDE\XLOCINFO.H
C:\PROGRAM FILES (X86)\WINDOWS KITS\10\INCLUDE\10.0.18362.0\UCRT\CTYPE.H
C:\PROGRAM FILES (X86)\WINDOWS KITS\10\INCLUDE\10.0.18362.0\UCRT\LOCALE.H
C:\USERS\KAYLYN\DOCUMENTS\SCHOOL\INT CG\LIL REPO\LINKEDIN-LEARNING\EX_FILES_UAR_OPENGL\EXERCISE FILES\INCLUDE\GL_MACROS.HPP
C:\USERS\KAYLYN\DOCUMENTS\SCHOOL\INT CG\LIL REPO\LINKEDIN-LEARNING\EX_FILES_UAR_OPENGL\EXERCISE FILES\INCLUDE\GL_SHADER.HPP
C:\USERS\KAYLYN\DOCUMENTS\SCHOOL\INT CG\LIL REPO\LINKEDIN-LEARNING\EX_FILES_UAR_OPENGL\EXERCISE FILES\GLM\GLM.HPP
C:\USERS\KAYLYN\DOCUMENTS\SCHOOL\INT CG\LIL REPO\LINKEDIN-LEARNING\EX_FILES_UAR_OPENGL\EXERCISE FILES\GLM\DETAIL\_FIXES.HPP
C:\PROGRAM FILES (X86)\MICROSOFT VISUAL STUDIO\2019\ENTERPRISE\VC\TOOLS\MSVC\14.24.28314\INCLUDE\CASSERT
C:\PROGRAM FILES (X86)\WINDOWS KITS\10\INCLUDE\10.0.18362.0\UCRT\ASSERT.H
C:\USERS\KAYLYN\DOCUMENTS\SCHOOL\INT CG\LIL REPO\LINKEDIN-LEARNING\EX_FILES_UAR_OPENGL\EXERCISE FILES\GLM\FWD.HPP
C:\USERS\KAYLYN\DOCUMENTS\SCHOOL\INT CG\LIL REPO\LINKEDIN-LEARNING\EX_FILES_UAR_OPENGL\EXERCISE FILES\GLM\DETAIL\TYPE_INT.HPP
C:\USERS\KAYLYN\DOCUMENTS\SCHOOL\INT CG\LIL REPO\LINKEDIN-LEARNING\EX_FILES_UAR_OPENGL\EXERCISE FILES\GLM\DETAIL\SETUP.HPP
C:\USERS\KAYLYN\DOCUMENTS\SCHOOL\INT CG\LIL REPO\LINKEDIN-LEARNING\EX_FILES_UAR_OPENGL\EXERCISE FILES\GLM\DETAIL\TYPE_FLOAT.HPP
C:\USERS\KAYLYN\DOCUMENTS\SCHOOL\INT CG\LIL REPO\LINKEDIN-LEARNING\EX_FILES_UAR_OPENGL\EXERCISE FILES\GLM\DETAIL\TYPE_VEC.HPP
C:\USERS\KAYLYN\DOCUMENTS\SCHOOL\INT CG\LIL REPO\LINKEDIN-LEARNING\EX_FILES_UAR_OPENGL\EXERCISE FILES\GLM\DETAIL\PRECISION.HPP
C:\USERS\KAYLYN\DOCUMENTS\SCHOOL\INT CG\LIL REPO\LINKEDIN-LEARNING\EX_FILES_UAR_OPENGL\EXERCISE FILES\GLM\DETAIL\TYPE_MAT.HPP
C:\USERS\KAYLYN\DOCUMENTS\SCHOOL\INT CG\LIL REPO\LINKEDIN-LEARNING\EX_FILES_UAR_OPENGL\EXERCISE FILES\GLM\VEC2.HPP
C:\USERS\KAYLYN\DOCUMENTS\SCHOOL\INT CG\LIL REPO\LINKEDIN-LEARNING\EX_FILES_UAR_OPENGL\EXERCISE FILES\GLM\DETAIL\TYPE_VEC2.HPP
C:\USERS\KAYLYN\DOCUMENTS\SCHOOL\INT CG\LIL REPO\LINKEDIN-LEARNING\EX_FILES_UAR_OPENGL\EXERCISE FILES\GLM\DETAIL\TYPE_VEC2.INL
C:\USERS\KAYLYN\DOCUMENTS\SCHOOL\INT CG\LIL REPO\LINKEDIN-LEARNING\EX_FILES_UAR_OPENGL\EXERCISE FILES\GLM\VEC3.HPP
C:\USERS\KAYLYN\DOCUMENTS\SCHOOL\INT CG\LIL REPO\LINKEDIN-LEARNING\EX_FILES_UAR_OPENGL\EXERCISE FILES\GLM\DETAIL\TYPE_VEC3.HPP
C:\USERS\KAYLYN\DOCUMENTS\SCHOOL\INT CG\LIL REPO\LINKEDIN-LEARNING\EX_FILES_UAR_OPENGL\EXERCISE FILES\GLM\DETAIL\TYPE_VEC3.INL
C:\USERS\KAYLYN\DOCUMENTS\SCHOOL\INT CG\LIL REPO\LINKEDIN-LEARNING\EX_FILES_UAR_OPENGL\EXERCISE FILES\GLM\VEC4.HPP
C:\USERS\KAYLYN\DOCUMENTS\SCHOOL\INT CG\LIL REPO\LINKEDIN-LEARNING\EX_FILES_UAR_OPENGL\EXERCISE FILES\GLM\DETAIL\TYPE_VEC4.HPP
C:\USERS\KAYLYN\DOCUMENTS\SCHOOL\INT CG\LIL REPO\LINKEDIN-LEARNING\EX_FILES_UAR_OPENGL\EXERCISE FILES\GLM\DETAIL\TYPE_VEC4.INL
C:\USERS\KAYLYN\DOCUMENTS\SCHOOL\INT CG\LIL REPO\LINKEDIN-LEARNING\EX_FILES_UAR_OPENGL\EXERCISE FILES\GLM\MAT2X2.HPP
C:\USERS\KAYLYN\DOCUMENTS\SCHOOL\INT CG\LIL REPO\LINKEDIN-LEARNING\EX_FILES_UAR_OPENGL\EXERCISE FILES\GLM\DETAIL\TYPE_MAT2X2.HPP
C:\USERS\KAYLYN\DOCUMENTS\SCHOOL\INT CG\LIL REPO\LINKEDIN-LEARNING\EX_FILES_UAR_OPENGL\EXERCISE FILES\GLM\DETAIL\TYPE_MAT2X2.INL
C:\USERS\KAYLYN\DOCUMENTS\SCHOOL\INT CG\LIL REPO\LINKEDIN-LEARNING\EX_FILES_UAR_OPENGL\EXERCISE FILES\GLM\MAT2X3.HPP
C:\USERS\KAYLYN\DOCUMENTS\SCHOOL\INT CG\LIL REPO\LINKEDIN-LEARNING\EX_FILES_UAR_OPENGL\EXERCISE FILES\GLM\DETAIL\TYPE_MAT2X3.HPP
C:\USERS\KAYLYN\DOCUMENTS\SCHOOL\INT CG\LIL REPO\LINKEDIN-LEARNING\EX_FILES_UAR_OPENGL\EXERCISE FILES\GLM\DETAIL\TYPE_MAT2X3.INL
C:\USERS\KAYLYN\DOCUMENTS\SCHOOL\INT CG\LIL REPO\LINKEDIN-LEARNING\EX_FILES_UAR_OPENGL\EXERCISE FILES\GLM\MAT2X4.HPP
C:\USERS\KAYLYN\DOCUMENTS\SCHOOL\INT CG\LIL REPO\LINKEDIN-LEARNING\EX_FILES_UAR_OPENGL\EXERCISE FILES\GLM\DETAIL\TYPE_MAT2X4.HPP
C:\USERS\KAYLYN\DOCUMENTS\SCHOOL\INT CG\LIL REPO\LINKEDIN-LEARNING\EX_FILES_UAR_OPENGL\EXERCISE FILES\GLM\DETAIL\TYPE_MAT2X4.INL
C:\USERS\KAYLYN\DOCUMENTS\SCHOOL\INT CG\LIL REPO\LINKEDIN-LEARNING\EX_FILES_UAR_OPENGL\EXERCISE FILES\GLM\MAT3X2.HPP
C:\USERS\KAYLYN\DOCUMENTS\SCHOOL\INT CG\LIL REPO\LINKEDIN-LEARNING\EX_FILES_UAR_OPENGL\EXERCISE FILES\GLM\DETAIL\TYPE_MAT3X2.HPP
C:\USERS\KAYLYN\DOCUMENTS\SCHOOL\INT CG\LIL REPO\LINKEDIN-LEARNING\EX_FILES_UAR_OPENGL\EXERCISE FILES\GLM\DETAIL\TYPE_MAT3X2.INL
C:\USERS\KAYLYN\DOCUMENTS\SCHOOL\INT CG\LIL REPO\LINKEDIN-LEARNING\EX_FILES_UAR_OPENGL\EXERCISE FILES\GLM\MAT3X3.HPP
C:\USERS\KAYLYN\DOCUMENTS\SCHOOL\INT CG\LIL REPO\LINKEDIN-LEARNING\EX_FILES_UAR_OPENGL\EXERCISE FILES\GLM\DETAIL\TYPE_MAT3X3.HPP
C:\USERS\KAYLYN\DOCUMENTS\SCHOOL\INT CG\LIL REPO\LINKEDIN-LEARNING\EX_FILES_UAR_OPENGL\EXERCISE FILES\GLM\DETAIL\TYPE_MAT3X3.INL
C:\USERS\KAYLYN\DOCUMENTS\SCHOOL\INT CG\LIL REPO\LINKEDIN-LEARNING\EX_FILES_UAR_OPENGL\EXERCISE FILES\GLM\MAT3X4.HPP
C:\USERS\KAYLYN\DOCUMENTS\SCHOOL\INT CG\LIL REPO\LINKEDIN-LEARNING\EX_FILES_UAR_OPENGL\EXERCISE FILES\GLM\DETAIL\TYPE_MAT3X4.HPP
C:\USERS\KAYLYN\DOCUMENTS\SCHOOL\INT CG\LIL REPO\LINKEDIN-LEARNING\EX_FILES_UAR_OPENGL\EXERCISE FILES\GLM\DETAIL\TYPE_MAT3X4.INL
C:\USERS\KAYLYN\DOCUMENTS\SCHOOL\INT CG\LIL REPO\LINKEDIN-LEARNING\EX_FILES_UAR_OPENGL\EXERCISE FILES\GLM\MAT4X2.HPP
C:\USERS\KAYLYN\DOCUMENTS\SCHOOL\INT CG\LIL REPO\LINKEDIN-LEARNING\EX_FILES_UAR_OPENGL\EXERCISE FILES\GLM\DETAIL\TYPE_MAT4X2.HPP
C:\USERS\KAYLYN\DOCUMENTS\SCHOOL\INT CG\LIL REPO\LINKEDIN-LEARNING\EX_FILES_UAR_OPENGL\EXERCISE FILES\GLM\DETAIL\TYPE_MAT4X2.INL
C:\USERS\KAYLYN\DOCUMENTS\SCHOOL\INT CG\LIL REPO\LINKEDIN-LEARNING\EX_FILES_UAR_OPENGL\EXERCISE FILES\GLM\MAT4X3.HPP
C:\USERS\KAYLYN\DOCUMENTS\SCHOOL\INT CG\LIL REPO\LINKEDIN-LEARNING\EX_FILES_UAR_OPENGL\EXERCISE FILES\GLM\DETAIL\TYPE_MAT4X3.HPP
C:\USERS\KAYLYN\DOCUMENTS\SCHOOL\INT CG\LIL REPO\LINKEDIN-LEARNING\EX_FILES_UAR_OPENGL\EXERCISE FILES\GLM\DETAIL\TYPE_MAT4X3.INL
C:\USERS\KAYLYN\DOCUMENTS\SCHOOL\INT CG\LIL REPO\LINKEDIN-LEARNING\EX_FILES_UAR_OPENGL\EXERCISE FILES\GLM\MAT4X4.HPP
C:\USERS\KAYLYN\DOCUMENTS\SCHOOL\INT CG\LIL REPO\LINKEDIN-LEARNING\EX_FILES_UAR_OPENGL\EXERCISE FILES\GLM\DETAIL\TYPE_MAT4X4.HPP
C:\USERS\KAYLYN\DOCUMENTS\SCHOOL\INT CG\LIL REPO\LINKEDIN-LEARNING\EX_FILES_UAR_OPENGL\EXERCISE FILES\GLM\DETAIL\TYPE_MAT4X4.INL
C:\USERS\KAYLYN\DOCUMENTS\SCHOOL\INT CG\LIL REPO\LINKEDIN-LEARNING\EX_FILES_UAR_OPENGL\EXERCISE FILES\GLM\TRIGONOMETRIC.HPP
C:\USERS\KAYLYN\DOCUMENTS\SCHOOL\INT CG\LIL REPO\LINKEDIN-LEARNING\EX_FILES_UAR_OPENGL\EXERCISE FILES\GLM\DETAIL\FUNC_TRIGONOMETRIC.HPP
C:\USERS\KAYLYN\DOCUMENTS\SCHOOL\INT CG\LIL REPO\LINKEDIN-LEARNING\EX_FILES_UAR_OPENGL\EXERCISE FILES\GLM\DETAIL\FUNC_TRIGONOMETRIC.INL
C:\USERS\KAYLYN\DOCUMENTS\SCHOOL\INT CG\LIL REPO\LINKEDIN-LEARNING\EX_FILES_UAR_OPENGL\EXERCISE FILES\GLM\DETAIL\_VECTORIZE.HPP
C:\USERS\KAYLYN\DOCUMENTS\SCHOOL\INT CG\LIL REPO\LINKEDIN-LEARNING\EX_FILES_UAR_OPENGL\EXERCISE FILES\GLM\DETAIL\TYPE_VEC1.HPP
C:\USERS\KAYLYN\DOCUMENTS\SCHOOL\INT CG\LIL REPO\LINKEDIN-LEARNING\EX_FILES_UAR_OPENGL\EXERCISE FILES\GLM\DETAIL\TYPE_VEC1.INL
C:\USERS\KAYLYN\DOCUMENTS\SCHOOL\INT CG\LIL REPO\LINKEDIN-LEARNING\EX_FILES_UAR_OPENGL\EXERCISE FILES\GLM\EXPONENTIAL.HPP
C:\USERS\KAYLYN\DOCUMENTS\SCHOOL\INT CG\LIL REPO\LINKEDIN-LEARNING\EX_FILES_UAR_OPENGL\EXERCISE FILES\GLM\DETAIL\FUNC_EXPONENTIAL.HPP
C:\USERS\KAYLYN\DOCUMENTS\SCHOOL\INT CG\LIL REPO\LINKEDIN-LEARNING\EX_FILES_UAR_OPENGL\EXERCISE FILES\GLM\DETAIL\FUNC_EXPONENTIAL.INL
C:\USERS\KAYLYN\DOCUMENTS\SCHOOL\INT CG\LIL REPO\LINKEDIN-LEARNING\EX_FILES_UAR_OPENGL\EXERCISE FILES\GLM\DETAIL\FUNC_VECTOR_RELATIONAL.HPP
C:\USERS\KAYLYN\DOCUMENTS\SCHOOL\INT CG\LIL REPO\LINKEDIN-LEARNING\EX_FILES_UAR_OPENGL\EXERCISE FILES\GLM\DETAIL\FUNC_VECTOR_RELATIONAL.INL
C:\USERS\KAYLYN\DOCUMENTS\SCHOOL\INT CG\LIL REPO\LINKEDIN-LEARNING\EX_FILES_UAR_OPENGL\EXERCISE FILES\GLM\COMMON.HPP
C:\USERS\KAYLYN\DOCUMENTS\SCHOOL\INT CG\LIL REPO\LINKEDIN-LEARNING\EX_FILES_UAR_OPENGL\EXERCISE FILES\GLM\DETAIL\FUNC_COMMON.HPP
C:\USERS\KAYLYN\DOCUMENTS\SCHOOL\INT CG\LIL REPO\LINKEDIN-LEARNING\EX_FILES_UAR_OPENGL\EXERCISE FILES\GLM\DETAIL\FUNC_COMMON.INL
C:\USERS\KAYLYN\DOCUMENTS\SCHOOL\INT CG\LIL REPO\LINKEDIN-LEARNING\EX_FILES_UAR_OPENGL\EXERCISE FILES\GLM\PACKING.HPP
C:\USERS\KAYLYN\DOCUMENTS\SCHOOL\INT CG\LIL REPO\LINKEDIN-LEARNING\EX_FILES_UAR_OPENGL\EXERCISE FILES\GLM\DETAIL\FUNC_PACKING.HPP
C:\USERS\KAYLYN\DOCUMENTS\SCHOOL\INT CG\LIL REPO\LINKEDIN-LEARNING\EX_FILES_UAR_OPENGL\EXERCISE FILES\GLM\DETAIL\FUNC_PACKING.INL
C:\USERS\KAYLYN\DOCUMENTS\SCHOOL\INT CG\LIL REPO\LINKEDIN-LEARNING\EX_FILES_UAR_OPENGL\EXERCISE FILES\GLM\DETAIL\TYPE_HALF.HPP
C:\USERS\KAYLYN\DOCUMENTS\SCHOOL\INT CG\LIL REPO\LINKEDIN-LEARNING\EX_FILES_UAR_OPENGL\EXERCISE FILES\GLM\DETAIL\TYPE_HALF.INL
C:\USERS\KAYLYN\DOCUMENTS\SCHOOL\INT CG\LIL REPO\LINKEDIN-LEARNING\EX_FILES_UAR_OPENGL\EXERCISE FILES\GLM\GEOMETRIC.HPP
C:\USERS\KAYLYN\DOCUMENTS\SCHOOL\INT CG\LIL REPO\LINKEDIN-LEARNING\EX_FILES_UAR_OPENGL\EXERCISE FILES\GLM\DETAIL\FUNC_GEOMETRIC.HPP
C:\USERS\KAYLYN\DOCUMENTS\SCHOOL\INT CG\LIL REPO\LINKEDIN-LEARNING\EX_FILES_UAR_OPENGL\EXERCISE FILES\GLM\DETAIL\FUNC_GEOMETRIC.INL
C:\USERS\KAYLYN\DOCUMENTS\SCHOOL\INT CG\LIL REPO\LINKEDIN-LEARNING\EX_FILES_UAR_OPENGL\EXERCISE FILES\GLM\MATRIX.HPP
C:\USERS\KAYLYN\DOCUMENTS\SCHOOL\INT CG\LIL REPO\LINKEDIN-LEARNING\EX_FILES_UAR_OPENGL\EXERCISE FILES\GLM\DETAIL\FUNC_MATRIX.HPP
C:\USERS\KAYLYN\DOCUMENTS\SCHOOL\INT CG\LIL REPO\LINKEDIN-LEARNING\EX_FILES_UAR_OPENGL\EXERCISE FILES\GLM\DETAIL\FUNC_MATRIX.INL
C:\USERS\KAYLYN\DOCUMENTS\SCHOOL\INT CG\LIL REPO\LINKEDIN-LEARNING\EX_FILES_UAR_OPENGL\EXERCISE FILES\GLM\VECTOR_RELATIONAL.HPP
C:\USERS\KAYLYN\DOCUMENTS\SCHOOL\INT CG\LIL REPO\LINKEDIN-LEARNING\EX_FILES_UAR_OPENGL\EXERCISE FILES\GLM\INTEGER.HPP
C:\USERS\KAYLYN\DOCUMENTS\SCHOOL\INT CG\LIL REPO\LINKEDIN-LEARNING\EX_FILES_UAR_OPENGL\EXERCISE FILES\GLM\DETAIL\FUNC_INTEGER.HPP
C:\USERS\KAYLYN\DOCUMENTS\SCHOOL\INT CG\LIL REPO\LINKEDIN-LEARNING\EX_FILES_UAR_OPENGL\EXERCISE FILES\GLM\DETAIL\FUNC_INTEGER.INL
C:\USERS\KAYLYN\DOCUMENTS\SCHOOL\INT CG\LIL REPO\LINKEDIN-LEARNING\EX_FILES_UAR_OPENGL\EXERCISE FILES\GLM\GTC\MATRIX_TRANSFORM.HPP
C:\USERS\KAYLYN\DOCUMENTS\SCHOOL\INT CG\LIL REPO\LINKEDIN-LEARNING\EX_FILES_UAR_OPENGL\EXERCISE FILES\GLM\GTC\MATRIX_TRANSFORM.INL
C:\USERS\KAYLYN\DOCUMENTS\SCHOOL\INT CG\LIL REPO\LINKEDIN-LEARNING\EX_FILES_UAR_OPENGL\EXERCISE FILES\GLM\GTC\TYPE_PTR.HPP
C:\USERS\KAYLYN\DOCUMENTS\SCHOOL\INT CG\LIL REPO\LINKEDIN-LEARNING\EX_FILES_UAR_OPENGL\EXERCISE FILES\GLM\GTC\QUATERNION.HPP
C:\USERS\KAYLYN\DOCUMENTS\SCHOOL\INT CG\LIL REPO\LINKEDIN-LEARNING\EX_FILES_UAR_OPENGL\EXERCISE FILES\GLM\GTC\CONSTANTS.HPP
C:\USERS\KAYLYN\DOCUMENTS\SCHOOL\INT CG\LIL REPO\LINKEDIN-LEARNING\EX_FILES_UAR_OPENGL\EXERCISE FILES\GLM\GTC\CONSTANTS.INL
C:\USERS\KAYLYN\DOCUMENTS\SCHOOL\INT CG\LIL REPO\LINKEDIN-LEARNING\EX_FILES_UAR_OPENGL\EXERCISE FILES\GLM\GTC\QUATERNION.INL
C:\USERS\KAYLYN\DOCUMENTS\SCHOOL\INT CG\LIL REPO\LINKEDIN-LEARNING\EX_FILES_UAR_OPENGL\EXERCISE FILES\GLM\GTC\TYPE_PTR.INL
