^C:\USERS\KAYLYN\DOCUMENTS\SCHOOL\INT CG\LIL REPO\LINKEDIN-LEARNING\EX_FILES_UAR_OPENGL\EXERCISE FILES\CMAKELISTS.TXT
setlocal
"C:\Program Files (x86)\CMake\bin\cmake.exe" "-SC:/Users/Kaylyn/Documents/School/Int CG/LIL Repo/linkedin-learning/Ex_Files_UaR_OpenGL/Exercise Files" "-BC:/Users/Kaylyn/Documents/School/Int CG/LIL Repo/linkedin-learning/Ex_Files_UaR_OpenGL/Exercise Files/visualstudio" --check-stamp-file "C:/Users/Kaylyn/Documents/School/Int CG/LIL Repo/linkedin-learning/Ex_Files_UaR_OpenGL/Exercise Files/visualstudio/CMakeFiles/generate.stamp"
if %errorlevel% neq 0 goto :cmEnd
:cmEnd
endlocal & call :cmErrorLevel %errorlevel% & goto :cmDone
:cmErrorLevel
exit /b %1
:cmDone
if %errorlevel% neq 0 goto :VCEnd
