{
    "edges": [
        {
            "dataRef": "10b16e61-6879-4319-a256-6ca61524393d",
            "edgeId": 0,
            "edgeType": "undirected",
            "flux": 0,
            "label": "edge_0",
            "modelElementRef": "",
            "source": 0,
            "target": 1
        },
        {
            "dataRef": "1f5d05e7-c468-4af9-b1a1-e008a80c080a",
            "edgeId": 1,
            "edgeType": "undirected",
            "flux": 0,
            "label": "edge_1",
            "modelElementRef": "",
            "source": 1,
            "target": 2
        },
        {
            "dataRef": "fb10c6ce-317d-4e48-8f14-7ac0fca268b7",
            "edgeId": 2,
            "edgeType": "undirected",
            "flux": 0,
            "label": "edge_2",
            "modelElementRef": "",
            "source": 2,
            "target": 3
        },
        {
            "dataRef": "24ed504e-f7c2-4620-ab07-ecfb00c34af3",
            "edgeId": 3,
            "edgeType": "undirected",
            "flux": 0,
            "label": "edge_3",
            "modelElementRef": "",
            "source": 3,
            "target": 4
        }
    ],
    "level": "organelle",
    "nodes": [
        {
            "dataRef": "b9b030d1-8013-441c-b93d-8f9e508c92d4",
            "isSecondaryMetabolite": false,
            "label": "node_0",
            "modelElementRef": "",
            "nodeId": 0,
            "nodeType": "circle",
            "x": 45,
            "y": 74
        },
        {
            "dataRef": "c165809a-a1dc-4e4a-8a63-6686b3f28504",
            "isSecondaryMetabolite": false,
            "label": "node_1",
            "modelElementRef": "",
            "nodeId": 1,
            "nodeType": "circle",
            "x": 81,
            "y": 14
        },
        {
            "dataRef": "d50afc56-4ee8-49a5-a9c0-8bc1e4a1e197",
            "isSecondaryMetabolite": false,
            "label": "node_2",
            "modelElementRef": "",
            "nodeId": 2,
            "nodeType": "circle",
            "x": 2,
            "y": 16
        },
        {
            "dataRef": "5ca3d452-9ce3-4729-a869-32bfee02c4af",
            "isSecondaryMetabolite": false,
            "label": "node_3",
            "modelElementRef": "",
            "nodeId": 3,
            "nodeType": "circle",
            "x": 4,
            "y": 38
        },
        {
            "dataRef": "ab48ec17-c44b-4a2a-a740-14da67d9b940",
            "isSecondaryMetabolite": false,
            "label": "node_4",
            "modelElementRef": "",
            "nodeId": 4,
            "nodeType": "circle",
            "x": 72,
            "y": 11
        }
    ]
}