{
    "edgeData": {
        "235fcaa9-0472-491e-a85c-2659729191cd": 1.0884160930770725,
        "3319f896-343d-41a4-9b99-54ab6efecadc": 7.9199873718386335,
        "93ee41ff-a3f8-4f3e-8287-bbf567fc69e3": 8.80729017395206,
        "aa4a61e8-d5d2-4efa-a142-5cc04eeaed86": 8.668116784124239,
        "af2503d3-d560-46a9-970d-146976c84656": 2.630468298796147,
        "c87c350f-63cc-4b32-8f21-8e7ae153774c": 6.2765619733930205,
        "d1ed55f6-10aa-4501-9c4e-185769ccffc2": 3.0046242618133356,
        "e2349b4d-2e9d-435e-b884-88b701c5b8a3": 8.136202261558639,
        "e722b1ab-d46f-45c0-9bef-415750b0f0f1": 5.1055485168152455
    },
    "level": "module",
    "nodeData": {
        "11fc2310-f8eb-4e43-b233-3778a5058cb8": 95.48533520271482,
        "269e932c-0b23-42cc-8f4f-b816a7fdb15a": 31.31848299464881,
        "2bf3c71a-8575-471a-a087-1e97a067e8b5": 12.239613377677072,
        "589da2a0-1836-460e-869d-69d580fd312a": 80.5961584659348,
        "5cfea9bb-43e5-4ebc-a6cc-3e10b9a99916": 14.110118365347423,
        "9380832f-31f8-4bdd-aa53-e3dc22e89d12": 44.686407535812336,
        "a830269a-d9da-4ed2-9c2f-e3209c2d55b5": 35.62622512487798,
        "da6f1e27-4ef1-4749-9915-dcf995b90c8f": 14.127620048792355,
        "e114869f-edc4-4178-82fc-7d2e977578a1": 84.09914930896029,
        "fdbd222a-f8fb-4917-98bb-5b1deb05fa4e": 26.310445523281743
    }
}