{
    "edgeData": {
        "08a48c7f-463a-4594-9066-23ef10c92623": 2.4691535027096565,
        "1aa09e08-6dd2-4b7c-ad7d-7ae5b8f8217f": 8.069360762875865,
        "40caeb80-b0a1-4570-b21f-8a30cefe9fca": 8.816163212908013,
        "4dc2d7b3-2ef2-46c4-a4a9-5c9cb0a98a4c": 2.808559108992182,
        "6d68078b-4e9e-4dbb-9eda-d0a8099c0e3e": 9.459773886127243,
        "76f9e21b-471c-4fb6-b0e2-ad99f7edcbff": 8.291228251177587,
        "9bf69d25-6368-4032-9229-07e8e479cfdd": 7.100048676353521,
        "b7ad7e36-5900-42c6-b7c0-f8f82ae2b8e3": 6.082792942430437,
        "b7eed93e-a6ca-4a2f-9aff-4444abb4e5b3": 9.65176736871562
    },
    "level": "module",
    "nodeData": {
        "0bb4212e-4b88-4d98-93f7-2af20f7359ce": 27.04445231316234,
        "26f42f63-0fa0-4637-9c7d-e6277ce8b72c": 66.00310384130293,
        "4d68b918-3953-402e-81e5-e96259d67f7f": 15.724023300074997,
        "6318af5c-b5f5-4e79-aab1-7ebee49a3501": 31.197747383410935,
        "7b46304a-8d10-49fb-bf6b-c6f6e8ab0de0": 52.449227756554905,
        "9ad05e8e-2675-4273-a8ec-fb36229c3a4a": 20.09991713915731,
        "aed61aa8-58f4-4f84-a79f-113a39618a81": 74.29573986939418,
        "c8d45823-dbf9-47f7-80f0-61b5928bd7e5": 10.367457603947372,
        "e89579b0-30d9-4cce-b42c-0c23cc8373b1": 13.591891952998903,
        "f2362428-5145-4d44-a119-0d27bbcb8b95": 25.810433350566985
    }
}