{
    "edgeData": {
        "06843ea2-b7f0-4a98-8c3c-d254449357f9": 1.2969217395493937,
        "1cd4780a-b7ca-4f61-986c-63db37ccdd62": 4.608968950983755,
        "20bdd6e8-8f16-45db-be55-7a97e5ea904b": 4.036737984295024,
        "4005f2bc-78f1-4ea0-9d8f-ded02e9e5165": 2.5608198529985615,
        "449e78b5-557a-4d0e-a894-a919045fd809": 5.451496279890382,
        "4cde1629-c41c-4d98-844a-92e8c34c1a34": 3.2482457269734724,
        "6266709f-cc6e-483b-85e4-b257ef005d5e": 2.5534635566327424,
        "72053ef7-32e0-47fd-802e-5aa02d3b1e53": 4.1458666155584325,
        "7c5949e5-f654-4bf3-8a54-d02739d37f20": 8.425611600875076,
        "a9583055-7cba-4441-af1c-93a8c2ded2e6": 9.206859117953512,
        "ec292fe1-4db7-42e4-9013-694199de8f71": 0.171514035962248,
        "ee048567-900b-4bb5-86af-b8f99f309340": 2.289638576172205,
        "f1865ba2-9d2f-42fa-a4c4-3a68bb8cc0e4": 4.282242080859034,
        "febbccfc-00b1-4a39-a126-43080a5726b1": 7.541087240967257
    },
    "level": "molecular",
    "nodeData": {
        "01e56ad5-01a4-47e8-b934-cf12fcebf8d7": 12.93315176911074,
        "174b72b7-5de8-4fa7-bb65-081522df328d": 22.341018823714087,
        "53eb57db-9388-4ef4-b4f8-ded681e9b53a": 41.91096899368585,
        "7aec64de-74c7-4aa7-967c-b6749408385a": 27.771574314315707,
        "7cd5085e-c1d3-4060-8d33-90657f5d1fa3": 22.400180668985314,
        "ac7151a4-6292-4c93-8fd7-7eebf998e663": 22.711630223281166,
        "bfa71edb-e3a5-4e93-891c-82f4605799fa": 65.11729022273684,
        "e7e8d203-924a-48bd-97c8-7c4b10ae3303": 23.198302376950963,
        "fe50d840-7ce7-4cdc-9b5f-0a176b9d6bd1": 12.811475051783273
    }
}