<?xml version="1.0" encoding="UTF-8" standalone="no"?>
<!-- Created with Inkscape (http://www.inkscape.org/) -->

<svg
   version="1.1"
   id="svg2"
   width="1122.52"
   height="793.70667"
   viewBox="0 0 1122.52 793.70667"
   sodipodi:docname="NRW_MKW_4c_engl_Pfade_7_2017_sw.eps"
   xmlns:inkscape="http://www.inkscape.org/namespaces/inkscape"
   xmlns:sodipodi="http://sodipodi.sourceforge.net/DTD/sodipodi-0.dtd"
   xmlns="http://www.w3.org/2000/svg"
   xmlns:svg="http://www.w3.org/2000/svg">
  <defs
     id="defs6" />
  <sodipodi:namedview
     id="namedview4"
     pagecolor="#ffffff"
     bordercolor="#000000"
     borderopacity="0.25"
     inkscape:showpageshadow="2"
     inkscape:pageopacity="0.0"
     inkscape:pagecheckerboard="0"
     inkscape:deskcolor="#d1d1d1" />
  <g
     id="g8"
     inkscape:groupmode="layer"
     inkscape:label="ink_ext_XXXXXX"
     transform="matrix(1.3333333,0,0,-1.3333333,0,793.70667)">
    <g
       id="g10"
       transform="scale(0.1)">
      <path
         d="m 7003.16,2192.36 c -382.81,0 -693.36,312.09 -693.36,696.99 v 768.64 h 1386.72 v -768.64 c 0,-384.9 -310.54,-696.99 -693.36,-696.99"
         style="fill:#ffffff;fill-opacity:1;fill-rule:evenodd;stroke:none"
         id="path12" />
      <path
         d="m 7703.49,3664.95 v -775.6 c 0,-388.71 -313.64,-703.95 -700.33,-703.95 -386.7,0 -700.32,315.24 -700.32,703.95 v 775.6 z m -26.11,-775.6 c 0,-374.42 -302.07,-677.85 -674.22,-677.85 -372.14,0 -674.22,303.43 -674.22,677.85 v 749.5 h 1348.44 v -749.5"
         style="fill:#231f20;fill-opacity:1;fill-rule:evenodd;stroke:none"
         id="path14" />
      <path
         d="m 7029.38,2261.81 c -6.18,-11 -15.26,-20.13 -26.22,-26.36 -10.9,6.19 -19.95,15.27 -26.12,26.21 10.21,1.55 19.49,5.87 26.23,14.01 6.73,-7.88 15.92,-12.22 26.11,-13.86 m -148.33,69.6 c -12.3,2.48 -23.73,8.28 -33.01,16.74 2.54,12.29 8.38,23.7 16.87,32.94 4.6,-9.18 11.52,-16.64 21.27,-20.55 -5.59,-8.91 -6.8,-19 -5.13,-29.13 m 20.55,162.35 c -1.48,12.52 0.5,25.25 5.7,36.74 12.47,1.38 25.13,-0.65 36.54,-5.85 -7.36,-7.27 -12.33,-16.23 -12.99,-26.81 -10.07,2.43 -20.06,0.57 -29.25,-4.08 m 160.72,30.8 c 11.46,5.27 24.18,7.33 36.72,5.94 5.17,-11.44 7.15,-24.11 5.71,-36.58 -9.18,4.77 -19.23,6.72 -29.49,4.09 -0.79,10.33 -5.67,19.24 -12.94,26.55 m 78.97,-143.34 c 8.56,-9.26 14.45,-20.72 17,-33.08 -9.28,-8.45 -20.72,-14.25 -33.02,-16.74 1.69,10.2 0.45,20.37 -5.24,29.31 9.58,3.96 16.56,11.34 21.26,20.51 m -138.15,-25.82 c -23.83,0 -43.13,19.32 -43.13,43.14 0,23.83 19.3,43.15 43.13,43.15 23.83,0 43.14,-19.32 43.14,-43.15 0,-23.82 -19.31,-43.14 -43.14,-43.14 m -639.4,1248.65 h 528.96 c -19.69,-21.62 -38.82,-43.7 -56.39,-67.14 -66.67,-89 -60.09,-213.18 -127.43,-300.23 -58.87,-76.1 -158.58,-96.02 -213.67,-166.32 -62.45,-79.69 -66.47,-189.23 -125.29,-270.74 -4.08,29.31 -6.18,59.27 -6.18,89.72 z m 622.02,-249.83 v -464.88 c 0,-234.46 -124.78,-439.47 -311.01,-551.81 -94.84,57.22 -173.75,138.46 -228.35,235.41 33.83,35.25 66.95,71 92.76,112.85 52.53,85.2 60.36,193.05 122.6,272.41 57.64,73.49 159.35,93.86 213.53,166.13 51.67,68.92 67.51,156.14 110.47,229.89"
         style="fill:#231f20;fill-opacity:1;fill-rule:nonzero;stroke:none"
         id="path16" />
      <path
         d="m 7020.57,3604.05 h 622.02 v -714.71 c 0,-234.46 -124.79,-439.47 -311.02,-551.81 -186.23,112.34 -311,317.35 -311,551.81 z m 596.31,-412.93 c 0,-41.72 -37.7,-59.75 -37.7,-90.89 0,-36.83 36.43,-54.63 36.43,-90.18 0,-36.76 -28.9,-42.98 -47.63,-36.63 0,0 11.69,2.83 11.69,17.15 0,43.56 -93.26,41.26 -93.26,109.66 0,35.76 25.37,64.25 25.37,85.35 0,10.75 -8.09,25.85 -21.89,30.62 19.09,13.55 51.15,5.24 59.41,-15.48 6.62,17.27 12.68,42.92 4.9,67.88 43.85,-16.81 62.62,-45.36 62.68,-77.28 z m -355.92,260.09 c 9.81,-16.33 34.72,0.02 34.72,0.02 0,0 -30.19,28.6 -34.72,-0.02 m 154.63,-907.99 c 0,21.55 21.17,40.2 23.3,41.99 1.04,-0.15 2.14,-0.24 3.23,-0.24 11.58,0 20.97,9.37 20.97,20.95 0,3.18 -0.72,6.18 -1.97,8.86 57.47,102.56 42.25,117.46 -46.82,190.24 -24.38,19.92 -31.89,78.16 -31.89,131.69 -35.41,82.74 -131.11,73.13 -167.19,154.33 l 41.83,-2.26 c 21.47,-1.17 36.52,11.81 43.66,22.47 6.68,9.97 0.11,23.58 -10.68,19.91 -4.85,-13.39 -17.96,-24.03 -32.47,-23.25 l -103.88,5.6 c -20.66,-20.54 -16.23,-50.28 19.92,-65.81 v -15.51 h 24.78 c 8.83,-28.03 9.15,-53.14 0.95,-70.06 -19.77,0 -42.06,23.59 -42.06,23.59 0.06,2.46 0.39,4.49 0.39,6.61 0,11.57 -9.4,20.95 -20.97,20.95 -1.64,0 -3.23,-0.19 -4.75,-0.53 -11.76,18.69 -9.9,58.69 -40.35,103.18 l 23.07,28.05 84.39,28.38 c 2.43,98.93 116.13,121.8 133.57,194.06 24.36,0 39.53,7.21 51.32,30.32 3.04,5.97 1.61,20.05 -13.62,17.02 -8.47,-23.97 -19.72,-28.2 -35.45,-28.2 -40.98,0 -74.03,6.88 -79.53,-11.35 -9.26,-30.79 -51.96,-11.48 -51.96,-11.48 l 10.45,7.61 c 0.86,-0.11 1.75,-0.16 2.64,-0.16 7.91,0 14.31,4.16 14.31,9.3 0,5.15 -6.4,9.31 -14.31,9.31 -7.9,0 -14.31,-4.16 -14.31,-9.31 0,-0.32 0.03,-0.63 0.09,-0.94 l -9.81,-7.12 c -12.64,0 -14.84,9.91 -15.15,14.6 5,-0.01 8.74,4.13 8.74,9.26 0,5.1 -3.74,9.25 -8.35,9.25 0.17,3.78 2.3,11.59 11.35,18.76 l 72.85,57.83 c 10.56,8.38 31.63,19.64 40.97,24.49 -1.14,15.86 4.87,36.78 4.87,51.57 0,0 21.43,-9.17 30.19,-30.01 6.48,-15.4 2.37,-24.97 -0.48,-32.51 3.96,-6.22 20.5,-6.27 22.43,9.65 0.77,6.27 0.66,13.67 -1.73,22.24 28.35,-3.09 68.28,-12.81 129.65,-6.61 -12.41,-14.41 -28.41,-24.82 -45.26,-32.34 30.58,-7.23 68.17,-22.29 86.97,-53.57 -14.71,-7.49 -30.83,-12.4 -46.82,-15.52 29.33,-25.53 40.82,-63.78 65.92,-79.24 -32.55,-9.02 -59.38,-6.47 -80.5,0.68 10.21,-20.87 26.03,-45.19 47.7,-56.29 -29.52,-13.28 -58.26,-20.86 -80.45,-25.17 6.95,-11.63 17.15,-25.94 29.62,-35.4 -22.95,-0.86 -41.36,-7.25 -52.07,-11.99 -1.93,-26.81 -9.3,-82.42 58.61,-154.12 90.52,-68.44 113.12,-120.28 41.76,-212.3 0,-46.64 7.8,-65.38 31.96,-113 -2.08,-4.64 -11.97,-27.03 -21.86,-54.44 -10.84,-30.01 -18.97,-62.98 -18.97,-91.96 0,0 -15.34,0.1 -15.34,-16.26 v -24.77 c -28.15,-8.78 -56.76,-9.13 -73.46,-1.03 m -352.27,603.92 c -13.06,12.91 -13.18,40.63 -13.09,45.57 1.85,0.97 3.58,2.23 5.13,3.79 8.19,8.17 8.19,21.45 0,29.63 -1.23,1.25 -2.59,2.29 -4.03,3.16 11.82,34.84 34.83,52.94 44.16,102.38 h 36.03 l 85.72,-67.22 c -15.28,-17.24 -27.94,-37.4 -33.81,-63.06 l -45.65,84.92 c -29.27,0 -47.23,-24.23 -32.07,-60.39 l -11.03,-11.07 16.98,-17.98 c -12.7,-25.14 -29.7,-42.67 -48.34,-49.73 m 134.36,-393.43 h 121.42 c 0,50.04 -37.17,82.87 -37.17,141.4 0,38.3 15.05,62.31 54.99,73.84 9.99,-9.06 18.98,-20.59 26.36,-36.36 0.35,-51.25 8.91,-86.45 21.14,-111.9 0,0 -27.58,-21.01 -27.58,-98.27 0,0 -109.54,5.04 -122.69,-9.27 h -17.25 v -24.73 c -26.98,-8.87 -52.09,-9.17 -70.05,-0.89 0,21.98 23.59,41.96 23.59,41.96 2.44,-0.09 4.48,-0.39 6.59,-0.39 11.58,0 20.97,9.37 20.97,20.96 0,1.25 -0.11,2.47 -0.32,3.65 m -271.81,-461.53 c -28.33,20.6 -38.95,56.34 -11.68,70.14 1.85,4.81 0.01,10.43 -4.3,13.23 -30.16,-4.86 -42.59,30.3 -31.76,63.64 10.83,33.32 41.54,54.44 63.09,32.77 5.13,-0.25 9.92,3.21 11.26,8.18 -13.94,27.2 15.65,49.89 50.69,49.89 35.03,0 64.63,-22.69 50.68,-49.89 1.34,-4.97 6.12,-8.43 11.26,-8.18 21.55,21.67 52.26,0.54 63.09,-32.79 10.83,-33.32 -1.59,-68.48 -31.76,-63.62 -4.32,-2.8 -6.14,-8.42 -4.31,-13.23 27.27,-13.81 16.66,-49.55 -11.7,-70.15 -28.34,-20.6 -65.61,-19.63 -70.31,10.56 -4,3.23 -9.91,3.23 -13.92,0 -4.7,-30.19 -41.97,-31.14 -70.33,-10.55 m 144.77,106.36 c 0,-37.27 -30.23,-67.5 -67.5,-67.5 -37.28,0 -67.49,30.23 -67.49,67.5 0,37.28 30.21,67.5 67.49,67.5 37.27,0 67.5,-30.22 67.5,-67.5"
         style="fill:#231f20;fill-opacity:1;fill-rule:evenodd;stroke:none"
         id="path18" />
      <path
         d="m 772.109,3342.77 v 238.91 h 53.274 l 63.914,-189.51 h 0.652 l 61.989,189.51 h 54.242 v -238.91 h -39.071 v 178.21 h -0.64 c -3.559,-16.46 -8.719,-31.96 -14.207,-48.75 l -46.496,-129.46 h -35.84 l -46.156,129.46 c -5.821,17.11 -9.372,27.45 -14.532,50.37 h -0.648 v -179.83 h -36.481"
         style="fill:#231f20;fill-opacity:1;fill-rule:nonzero;stroke:none"
         id="path20" />
      <path
         d="m 1057.16,3514.21 h 40.03 v -171.43 h -40.03 z m -0.32,64.25 h 40.68 v -34.54 h -40.68 v 34.54"
         style="fill:#231f20;fill-opacity:1;fill-rule:nonzero;stroke:none"
         id="path22" />
      <path
         d="m 1143.67,3342.77 v 171.43 h 39.71 v -27.44 c 12.91,14.85 32.93,30.67 61.34,30.67 31.32,0 50.7,-16.14 50.7,-50.04 v -124.62 h -39.72 v 113.32 c 0,18.73 -7.75,28.41 -25.83,28.41 -17.42,0 -31.95,-8.72 -46.49,-22.28 v -119.45 h -39.71"
         style="fill:#231f20;fill-opacity:1;fill-rule:nonzero;stroke:none"
         id="path24" />
      <path
         d="m 1339.63,3514.21 h 40.03 v -171.43 h -40.03 z m -0.32,64.25 h 40.68 v -34.54 h -40.68 v 34.54"
         style="fill:#231f20;fill-opacity:1;fill-rule:nonzero;stroke:none"
         id="path26" />
      <path
         d="m 1412.91,3366.34 21.63,24.21 c 12.91,-10.97 31.95,-20.33 53.92,-20.33 21.3,0 34.22,5.48 34.22,19.69 0,13.88 -17.45,18.08 -38.1,22.92 -29.38,6.78 -64.58,14.53 -64.58,54.24 0,30.03 25.83,50.36 63.6,50.36 32.62,0 52.64,-9.36 70.38,-24.21 l -19.03,-25.83 c -12.6,10.33 -32.93,18.73 -48.44,18.73 -21.94,0 -29.05,-7.75 -29.05,-17.44 0,-13.88 17.11,-18.08 37.45,-22.6 29.38,-6.45 65.22,-13.88 65.22,-53.91 0,-36.16 -32.62,-52.95 -71.67,-52.95 -31.64,0 -60.05,11.3 -75.55,27.12"
         style="fill:#231f20;fill-opacity:1;fill-rule:nonzero;stroke:none"
         id="path28" />
      <path
         d="m 1604.99,3387.65 v 94.92 h -29.7 v 31.64 h 29.7 v 59.72 h 39.71 v -59.72 h 44.23 v -31.64 h -44.23 v -84.91 c 0,-18.4 5.49,-25.83 25.18,-25.83 5.81,0 13.24,0.97 17.11,2.26 v -31.32 c -4.19,-0.96 -19.04,-2.26 -29.05,-2.26 -43.59,0 -52.95,16.14 -52.95,47.14"
         style="fill:#231f20;fill-opacity:1;fill-rule:nonzero;stroke:none"
         id="path30" />
      <path
         d="m 1721.53,3342.77 v 171.43 h 39.71 v -28.07 h 0.64 c 10.66,17.1 29.06,31.3 61.67,31.3 h 2.58 l -1.29,-36.48 c -1.94,0.32 -8.39,0.65 -10.65,0.65 -25.51,0 -41.65,-11.94 -52.95,-30.35 v -108.48 h -39.71"
         style="fill:#231f20;fill-opacity:1;fill-rule:nonzero;stroke:none"
         id="path32" />
      <path
         d="m 1835.16,3281.43 9.03,31.96 c 4.84,-1.29 15.18,-3.55 29.07,-3.55 14.2,0 21.62,5.49 27.12,19.37 l 4.83,12.59 -65.85,172.4 h 41.31 l 44.24,-124.94 h 0.65 l 43.9,124.94 h 39.38 l -72.96,-190.15 c -11.3,-30.03 -26.14,-47.79 -60.05,-47.79 -20.34,0 -32.29,2.91 -40.67,5.17"
         style="fill:#231f20;fill-opacity:1;fill-rule:nonzero;stroke:none"
         id="path34" />
      <path
         d="m 2232.88,3428.33 c 0,31.96 -13.56,55.21 -43.58,55.21 -28.74,0 -43.59,-20.66 -43.59,-55.21 0,-32.61 13.24,-55.85 43.59,-55.85 28.73,0 43.58,20.66 43.58,55.85 m -127.2,0 c 0,63.28 41.65,89.11 83.62,89.11 41.64,0 83.61,-25.83 83.61,-89.11 0,-62.63 -41.97,-89.11 -83.61,-89.11 -41.65,0 -83.62,26.48 -83.62,89.11"
         style="fill:#231f20;fill-opacity:1;fill-rule:nonzero;stroke:none"
         id="path36" />
      <path
         d="m 2319.39,3342.77 v 139.79 h -29.7 v 31.64 h 29.7 v 17.44 c 0,28.73 11.94,51.01 55.53,51.01 7.43,0 20.66,-1.29 23.57,-1.62 v -30.67 c -2.59,0.65 -9.04,1.29 -13.56,1.29 -14.21,0 -25.83,-3.87 -25.83,-22.27 v -15.18 h 37.45 v -31.64 h -37.45 v -139.79 h -39.71"
         style="fill:#231f20;fill-opacity:1;fill-rule:nonzero;stroke:none"
         id="path38" />
      <path
         d="m 2499.52,3462.87 c 0,80.08 44.88,123.33 104.93,123.33 55.53,0 82,-30.67 92.65,-74.25 l -38.41,-10.98 c -9.04,31.63 -22.93,47.78 -54.57,47.78 -40.35,0 -63.92,-31.32 -63.92,-85.55 0,-56.83 24.21,-88.14 64.57,-88.14 30.99,0 48.43,15.49 57.47,51.33 l 38.42,-8.72 c -11.63,-47.46 -41.01,-79.42 -96.21,-79.42 -61.34,0 -104.93,42.29 -104.93,124.62"
         style="fill:#231f20;fill-opacity:1;fill-rule:nonzero;stroke:none"
         id="path40" />
      <path
         d="m 2735.83,3391.2 v 123.01 h 40.03 v -113.65 c 0,-19.05 8.07,-27.76 25.51,-27.76 17.43,0 31.96,9.04 46.49,22.27 v 119.14 h 40.03 v -171.44 h -40.03 v 23.25 c -10.98,-11.62 -31.64,-26.48 -62.63,-26.48 -30.03,0 -49.4,17.76 -49.4,51.66"
         style="fill:#231f20;fill-opacity:1;fill-rule:nonzero;stroke:none"
         id="path42" />
      <path
         d="m 2934.04,3581.68 h 40.03 v -238.91 h -40.03 v 238.91"
         style="fill:#231f20;fill-opacity:1;fill-rule:nonzero;stroke:none"
         id="path44" />
      <path
         d="m 3033.79,3387.65 v 94.92 h -29.7 v 31.64 h 29.7 v 59.72 h 39.71 v -59.72 h 44.23 v -31.64 h -44.23 v -84.91 c 0,-18.4 5.49,-25.83 25.18,-25.83 5.81,0 13.24,0.97 17.11,2.26 v -31.32 c -4.19,-0.96 -19.04,-2.26 -29.05,-2.26 -43.59,0 -52.95,16.14 -52.95,47.14"
         style="fill:#231f20;fill-opacity:1;fill-rule:nonzero;stroke:none"
         id="path46" />
      <path
         d="m 3148.39,3391.2 v 123.01 h 40.03 v -113.65 c 0,-19.05 8.07,-27.76 25.52,-27.76 17.43,0 31.95,9.04 46.48,22.27 v 119.14 h 40.03 v -171.44 h -40.03 v 23.25 c -10.98,-11.62 -31.64,-26.48 -62.63,-26.48 -30.03,0 -49.4,17.76 -49.4,51.66"
         style="fill:#231f20;fill-opacity:1;fill-rule:nonzero;stroke:none"
         id="path48" />
      <path
         d="m 3345,3342.77 v 171.43 h 39.71 v -28.07 h 0.64 c 10.66,17.1 29.05,31.3 61.67,31.3 h 2.57 l -1.28,-36.48 c -1.94,0.32 -8.39,0.65 -10.65,0.65 -25.51,0 -41.65,-11.94 -52.95,-30.35 V 3342.77 H 3345"
         style="fill:#231f20;fill-opacity:1;fill-rule:nonzero;stroke:none"
         id="path50" />
      <path
         d="m 3580.66,3445.12 c -2.26,26.15 -15.17,40.03 -39.06,40.03 -19.38,0 -37.13,-10.97 -41.01,-40.03 z m -120.42,-16.79 c 0,65.22 46.17,89.11 81.68,89.11 38.42,0 75.22,-22.92 75.22,-92.66 v -9.36 h -117.19 c 1.61,-31 20.67,-44.56 45.84,-44.56 22.28,0 35.19,7.43 48.11,20.02 l 20.98,-20.66 c -17.75,-19.7 -41.32,-31 -71.99,-31 -42.94,0 -82.65,26.16 -82.65,89.11"
         style="fill:#231f20;fill-opacity:1;fill-rule:nonzero;stroke:none"
         id="path52" />
      <path
         d="m 3833.75,3390.55 v 37.78 c -47.46,-6.45 -72.64,-18.08 -72.64,-36.8 0,-13.56 9.36,-20.66 23.89,-20.66 20.34,0 36.16,7.75 48.75,19.68 m -111.7,-6.46 c 0,37.13 31.63,62 111.7,71.03 v 5.18 c 0,17.1 -9.04,24.53 -28.09,24.53 -23.89,0 -43.26,-11.62 -57.78,-23.25 l -19.37,24.86 c 18.39,16.79 47.13,30.99 82.64,30.99 45.85,0 61.66,-21.94 61.66,-61.98 v -70.71 c 0,-20.66 1.3,-33.24 4.86,-41.96 h -40.05 c -2.26,7.1 -3.87,12.27 -3.87,21.94 -17.43,-17.75 -37.76,-24.53 -63.28,-24.53 -27.76,0 -48.42,15.5 -48.42,43.9"
         style="fill:#231f20;fill-opacity:1;fill-rule:nonzero;stroke:none"
         id="path54" />
      <path
         d="m 3915.74,3342.77 v 171.43 h 39.71 v -27.44 c 12.91,14.85 32.93,30.67 61.34,30.67 31.32,0 50.69,-16.14 50.69,-50.04 v -124.62 h -39.71 v 113.32 c 0,18.73 -7.75,28.41 -25.83,28.41 -17.43,0 -31.96,-8.72 -46.49,-22.28 v -119.45 h -39.71"
         style="fill:#231f20;fill-opacity:1;fill-rule:nonzero;stroke:none"
         id="path56" />
      <path
         d="m 4223.08,3394.43 v 68.76 c -10.66,13.89 -26.16,21.31 -40.37,21.31 -30.01,0 -42.29,-19.37 -42.29,-57.46 0,-36.16 15.51,-54.24 41.01,-54.24 16.47,0 32.28,10.33 41.65,21.63 m -122.36,33.58 c 0,59.4 29.38,89.42 73.28,89.42 18.41,0 36.49,-7.42 49.08,-21.63 v 85.88 h 39.7 v -196.94 c 0,-20.66 1.29,-33.25 5.18,-41.97 h -41.02 c -2.25,4.84 -3.86,14.53 -3.86,23.25 -12.59,-14.53 -29.07,-25.83 -54.56,-25.83 -39.08,0 -67.8,28.41 -67.8,87.82"
         style="fill:#231f20;fill-opacity:1;fill-rule:nonzero;stroke:none"
         id="path58" />
      <path
         d="m 4380.61,3398.95 31.95,16.79 c 14.22,-28.09 36.16,-41.65 65.86,-41.65 29.06,0 48.75,9.36 48.75,30.99 0,20.66 -14.85,30.35 -54.23,41.97 -46.16,13.56 -83.3,26.15 -83.3,71.68 0,40.67 33.25,67.47 81.68,67.47 47.14,0 74.9,-23.24 89.43,-51.33 l -29.37,-20.34 c -14.22,23.89 -34.55,34.87 -60.37,34.87 -26.49,0 -41.65,-9.69 -41.65,-27.12 0,-22.28 17.1,-29.7 56.18,-41.33 45.18,-13.23 81.34,-28.08 81.34,-72.96 0,-39.07 -33.25,-69.74 -90.06,-69.74 -47.46,0 -81.05,24.54 -96.21,60.7"
         style="fill:#231f20;fill-opacity:1;fill-rule:nonzero;stroke:none"
         id="path60" />
      <path
         d="m 4593.03,3428.33 c 0,65.54 44.23,89.11 82.31,89.11 42.63,0 60.7,-23.57 71.04,-50.04 l -33.58,-11.95 c -6.77,19.37 -19.05,28.73 -38.09,28.73 -22.61,0 -41.65,-14.85 -41.65,-55.85 0,-36.48 14.84,-56.5 40.99,-56.5 18.08,0 30.68,5.49 40.04,29.7 l 32.93,-11.94 c -12.26,-27.44 -32.61,-50.37 -73.92,-50.37 -39.72,0 -80.07,26.48 -80.07,89.11"
         style="fill:#231f20;fill-opacity:1;fill-rule:nonzero;stroke:none"
         id="path62" />
      <path
         d="m 4780.26,3514.21 h 40.03 v -171.43 h -40.03 z m -0.32,64.25 h 40.68 v -34.54 h -40.68 v 34.54"
         style="fill:#231f20;fill-opacity:1;fill-rule:nonzero;stroke:none"
         id="path64" />
      <path
         d="m 4977.19,3445.12 c -2.26,26.15 -15.17,40.03 -39.07,40.03 -19.37,0 -37.12,-10.97 -41,-40.03 z m -120.42,-16.79 c 0,65.22 46.16,89.11 81.68,89.11 38.41,0 75.22,-22.92 75.22,-92.66 v -9.36 h -117.19 c 1.61,-31 20.66,-44.56 45.84,-44.56 22.28,0 35.19,7.43 48.11,20.02 l 20.98,-20.66 c -17.76,-19.7 -41.32,-31 -71.99,-31 -42.94,0 -82.65,26.16 -82.65,89.11"
         style="fill:#231f20;fill-opacity:1;fill-rule:nonzero;stroke:none"
         id="path66" />
      <path
         d="m 5048.85,3342.77 v 171.43 h 39.7 v -27.44 c 12.91,14.85 32.93,30.67 61.34,30.67 31.33,0 50.7,-16.14 50.7,-50.04 v -124.62 h -39.71 v 113.32 c 0,18.73 -7.75,28.41 -25.83,28.41 -17.44,0 -31.96,-8.72 -46.5,-22.28 v -119.45 h -39.7"
         style="fill:#231f20;fill-opacity:1;fill-rule:nonzero;stroke:none"
         id="path68" />
      <path
         d="m 5233.51,3428.33 c 0,65.54 44.22,89.11 82.31,89.11 42.62,0 60.7,-23.57 71.04,-50.04 l -33.58,-11.95 c -6.78,19.37 -19.05,28.73 -38.09,28.73 -22.61,0 -41.65,-14.85 -41.65,-55.85 0,-36.48 14.84,-56.5 40.99,-56.5 18.08,0 30.68,5.49 40.04,29.7 l 32.93,-11.94 c -12.27,-27.44 -32.61,-50.37 -73.93,-50.37 -39.71,0 -80.06,26.48 -80.06,89.11"
         style="fill:#231f20;fill-opacity:1;fill-rule:nonzero;stroke:none"
         id="path70" />
      <path
         d="m 5527.29,3445.12 c -2.27,26.15 -15.18,40.03 -39.08,40.03 -19.37,0 -37.12,-10.97 -41,-40.03 z m -120.43,-16.79 c 0,65.22 46.16,89.11 81.68,89.11 38.42,0 75.22,-22.92 75.22,-92.66 v -9.36 h -117.19 c 1.61,-31 20.66,-44.56 45.84,-44.56 22.28,0 35.19,7.43 48.11,20.02 l 20.98,-20.66 c -17.76,-19.7 -41.32,-31 -71.99,-31 -42.94,0 -82.65,26.16 -82.65,89.11"
         style="fill:#231f20;fill-opacity:1;fill-rule:nonzero;stroke:none"
         id="path72" />
      <path
         d="m 884.785,3040.94 c 0,31.96 -13.558,55.21 -43.578,55.21 -28.742,0 -43.594,-20.66 -43.594,-55.21 0,-32.61 13.242,-55.85 43.594,-55.85 28.727,0 43.578,20.66 43.578,55.85 m -127.203,0 c 0,63.28 41.652,89.11 83.625,89.11 41.637,0 83.606,-25.83 83.606,-89.11 0,-62.63 -41.969,-89.12 -83.606,-89.12 -41.652,0 -83.625,26.49 -83.625,89.12"
         style="fill:#231f20;fill-opacity:1;fill-rule:nonzero;stroke:none"
         id="path74" />
      <path
         d="m 971.293,2955.38 v 139.8 h -29.699 v 31.64 h 29.699 v 17.43 c 0,28.73 11.937,51.01 55.527,51.01 7.43,0 20.67,-1.29 23.57,-1.62 v -30.67 c -2.59,0.65 -9.04,1.3 -13.56,1.3 -14.21,0 -25.83,-3.88 -25.83,-22.28 v -15.17 h 37.45 v -31.64 H 1011 v -139.8 h -39.707"
         style="fill:#231f20;fill-opacity:1;fill-rule:nonzero;stroke:none"
         id="path76" />
      <path
         d="m 1171.76,3000.26 v 94.92 h -29.7 v 31.64 h 29.7 v 59.72 h 39.71 v -59.72 h 44.23 v -31.64 h -44.23 v -84.91 c 0,-18.4 5.49,-25.83 25.19,-25.83 5.8,0 13.23,0.97 17.1,2.26 v -31.32 c -4.18,-0.97 -19.04,-2.26 -29.05,-2.26 -43.59,0 -52.95,16.14 -52.95,47.14"
         style="fill:#231f20;fill-opacity:1;fill-rule:nonzero;stroke:none"
         id="path78" />
      <path
         d="m 1288.3,2955.38 v 238.91 h 40.03 v -90.72 c 10.98,11.62 31.64,26.47 62.64,26.47 30.02,0 49.39,-17.75 49.39,-51.65 v -123.01 h -40.03 v 113 c 0,19.05 -8.07,27.77 -25.51,27.77 -17.43,0 -31.96,-9.04 -46.49,-22.28 v -118.49 h -40.03"
         style="fill:#231f20;fill-opacity:1;fill-rule:nonzero;stroke:none"
         id="path80" />
      <path
         d="m 1593.7,3057.73 c -2.26,26.15 -15.17,40.03 -39.06,40.03 -19.38,0 -37.13,-10.97 -41.01,-40.03 z m -120.42,-16.79 c 0,65.22 46.17,89.11 81.68,89.11 38.42,0 75.22,-22.92 75.22,-92.66 v -9.36 h -117.19 c 1.61,-31 20.66,-44.56 45.84,-44.56 22.28,0 35.19,7.43 48.11,20.02 l 20.98,-20.66 c -17.75,-19.69 -41.32,-31.01 -71.99,-31.01 -42.94,0 -82.65,26.17 -82.65,89.12"
         style="fill:#231f20;fill-opacity:1;fill-rule:nonzero;stroke:none"
         id="path82" />
      <path
         d="m 1739.28,3075.81 c 0,76.51 41.65,123.01 105.25,123.01 45.2,0 78.45,-20.99 92.66,-75.23 l -37.45,-10.01 c -10.66,35.84 -27.12,47.77 -55.53,47.77 -28.41,0 -64.25,-17.42 -64.25,-84.58 0,-66.82 31.96,-89.74 65.87,-89.74 31.63,0 53.26,18.72 55.84,53.9 h -48.1 v 32.62 h 86.85 v -118.16 h -33.26 v 34.54 h -0.64 c -7.43,-17.11 -28.4,-39.06 -65.22,-39.06 -68.44,0 -102.02,51.98 -102.02,124.94"
         style="fill:#231f20;fill-opacity:1;fill-rule:nonzero;stroke:none"
         id="path84" />
      <path
         d="m 2097.3,3057.73 c -2.26,26.15 -15.17,40.03 -39.05,40.03 -19.38,0 -37.14,-10.97 -41.01,-40.03 z m -120.42,-16.79 c 0,65.22 46.18,89.11 81.68,89.11 38.42,0 75.22,-22.92 75.22,-92.66 v -9.36 H 2016.6 c 1.6,-31 20.66,-44.56 45.84,-44.56 22.28,0 35.19,7.43 48.11,20.02 l 20.97,-20.66 c -17.75,-19.69 -41.31,-31.01 -71.98,-31.01 -42.94,0 -82.66,26.17 -82.66,89.12"
         style="fill:#231f20;fill-opacity:1;fill-rule:nonzero;stroke:none"
         id="path86" />
      <path
         d="m 2168.64,2955.38 v 171.44 h 39.71 v -28.09 h 0.64 c 10.66,17.11 29.06,31.31 61.67,31.31 h 2.58 l -1.29,-36.48 c -1.94,0.32 -8.39,0.65 -10.65,0.65 -25.51,0 -41.65,-11.95 -52.95,-30.35 v -108.48 h -39.71"
         style="fill:#231f20;fill-opacity:1;fill-rule:nonzero;stroke:none"
         id="path88" />
      <path
         d="m 2301.64,2955.38 v 171.44 h 39.71 v -23.57 c 13.24,14.53 32.61,26.79 58.76,26.79 28.73,0 40.03,-11.3 46.81,-28.09 13.56,14.86 33.9,28.09 60.05,28.09 34.87,0 50.04,-20.98 50.04,-51.65 v -123.01 h -39.71 v 113 c 0,19.05 -5.48,27.77 -24.21,27.77 -16.14,0 -29.06,-9.04 -43.91,-22.28 v -118.49 h -39.71 v 113 c 0,19.05 -5.49,27.77 -24.21,27.77 -15.82,0 -29.06,-9.04 -43.91,-22.28 v -118.49 h -39.71"
         style="fill:#231f20;fill-opacity:1;fill-rule:nonzero;stroke:none"
         id="path90" />
      <path
         d="m 2700.66,3003.17 v 37.76 c -47.46,-6.45 -72.64,-18.08 -72.64,-36.8 0,-13.56 9.36,-20.66 23.89,-20.66 20.34,0 36.16,7.76 48.75,19.7 m -111.71,-6.46 c 0,37.13 31.64,61.98 111.71,71.03 v 5.17 c 0,17.11 -9.04,24.52 -28.09,24.52 -23.89,0 -43.26,-11.61 -57.79,-23.23 l -19.37,24.85 c 18.4,16.8 47.14,31 82.65,31 45.85,0 61.66,-21.96 61.66,-62 v -70.69 c 0,-20.66 1.3,-33.26 4.85,-41.97 h -40.04 c -2.26,7.1 -3.87,12.26 -3.87,21.95 -17.43,-17.75 -37.77,-24.55 -63.28,-24.55 -27.76,0 -48.43,15.5 -48.43,43.92"
         style="fill:#231f20;fill-opacity:1;fill-rule:nonzero;stroke:none"
         id="path92" />
      <path
         d="m 2782.65,2955.38 v 171.44 h 39.7 v -27.45 c 12.91,14.85 32.93,30.67 61.34,30.67 31.32,0 50.69,-16.14 50.69,-50.04 v -124.62 h -39.71 v 113.32 c 0,18.73 -7.75,28.41 -25.83,28.41 -17.42,0 -31.96,-8.71 -46.49,-22.27 v -119.46 h -39.7"
         style="fill:#231f20;fill-opacity:1;fill-rule:nonzero;stroke:none"
         id="path94" />
      <path
         d="m 3050.26,3011.56 31.96,16.79 c 14.21,-28.09 36.16,-41.65 65.86,-41.65 29.06,0 48.75,9.36 48.75,30.99 0,20.66 -14.85,30.35 -54.23,41.97 -46.17,13.56 -83.3,26.15 -83.3,71.68 0,40.67 33.25,67.47 81.68,67.47 47.14,0 74.9,-23.24 89.43,-51.33 l -29.38,-20.34 c -14.2,23.89 -34.54,34.87 -60.37,34.87 -26.47,0 -41.65,-9.69 -41.65,-27.12 0,-22.28 17.11,-29.7 56.18,-41.33 45.2,-13.23 81.35,-28.08 81.35,-72.96 0,-39.07 -33.25,-69.74 -90.07,-69.74 -47.46,0 -81.04,24.54 -96.21,60.7"
         style="fill:#231f20;fill-opacity:1;fill-rule:nonzero;stroke:none"
         id="path96" />
      <path
         d="m 3289.16,3000.26 v 94.92 h -29.71 v 31.64 h 29.71 v 59.72 h 39.71 v -59.72 h 44.23 v -31.64 h -44.23 v -84.91 c 0,-18.4 5.49,-25.83 25.17,-25.83 5.81,0 13.25,0.97 17.11,2.26 v -31.32 c -4.19,-0.97 -19.04,-2.26 -29.05,-2.26 -43.58,0 -52.94,16.14 -52.94,47.14"
         style="fill:#231f20;fill-opacity:1;fill-rule:nonzero;stroke:none"
         id="path98" />
      <path
         d="m 3505.46,3003.17 v 37.76 c -47.46,-6.45 -72.64,-18.08 -72.64,-36.8 0,-13.56 9.36,-20.66 23.89,-20.66 20.34,0 36.16,7.76 48.75,19.7 m -111.71,-6.46 c 0,37.13 31.64,61.98 111.71,71.03 v 5.17 c 0,17.11 -9.04,24.52 -28.09,24.52 -23.89,0 -43.26,-11.61 -57.79,-23.23 l -19.37,24.85 c 18.4,16.8 47.14,31 82.65,31 45.85,0 61.66,-21.96 61.66,-62 v -70.69 c 0,-20.66 1.3,-33.26 4.85,-41.97 h -40.04 c -2.26,7.1 -3.87,12.26 -3.87,21.95 -17.43,-17.75 -37.77,-24.55 -63.28,-24.55 -27.76,0 -48.43,15.5 -48.43,43.92"
         style="fill:#231f20;fill-opacity:1;fill-rule:nonzero;stroke:none"
         id="path100" />
      <path
         d="m 3600.68,3000.26 v 94.92 h -29.7 v 31.64 h 29.7 v 59.72 h 39.71 v -59.72 h 44.23 v -31.64 h -44.23 v -84.91 c 0,-18.4 5.49,-25.83 25.18,-25.83 5.81,0 13.24,0.97 17.11,2.26 v -31.32 c -4.19,-0.97 -19.04,-2.26 -29.05,-2.26 -43.59,0 -52.95,16.14 -52.95,47.14"
         style="fill:#231f20;fill-opacity:1;fill-rule:nonzero;stroke:none"
         id="path102" />
      <path
         d="m 3826.34,3057.73 c -2.25,26.15 -15.16,40.03 -39.05,40.03 -19.38,0 -37.13,-10.97 -41.02,-40.03 z m -120.42,-16.79 c 0,65.22 46.17,89.11 81.68,89.11 38.43,0 75.22,-22.92 75.22,-92.66 v -9.36 h -117.19 c 1.62,-31 20.66,-44.56 45.84,-44.56 22.28,0 35.2,7.43 48.11,20.02 l 20.99,-20.66 c -17.76,-19.69 -41.33,-31.01 -72,-31.01 -42.94,0 -82.65,26.17 -82.65,89.12"
         style="fill:#231f20;fill-opacity:1;fill-rule:nonzero;stroke:none"
         id="path104" />
      <path
         d="m 884.785,2653.55 c 0,31.96 -13.558,55.21 -43.578,55.21 -28.742,0 -43.594,-20.67 -43.594,-55.21 0,-32.62 13.242,-55.86 43.594,-55.86 28.727,0 43.578,20.67 43.578,55.86 m -127.203,0 c 0,63.27 41.652,89.1 83.625,89.1 41.637,0 83.606,-25.83 83.606,-89.1 0,-62.63 -41.969,-89.11 -83.606,-89.11 -41.652,0 -83.625,26.48 -83.625,89.11"
         style="fill:#231f20;fill-opacity:1;fill-rule:nonzero;stroke:none"
         id="path106" />
      <path
         d="m 971.293,2568 v 139.78 h -29.699 v 31.64 h 29.699 v 17.44 c 0,28.73 11.937,51.01 55.527,51.01 7.43,0 20.67,-1.29 23.57,-1.61 v -30.68 c -2.59,0.66 -9.04,1.3 -13.56,1.3 -14.21,0 -25.83,-3.87 -25.83,-22.27 v -15.19 h 37.45 v -31.64 H 1011 V 2568 h -39.707"
         style="fill:#231f20;fill-opacity:1;fill-rule:nonzero;stroke:none"
         id="path108" />
      <path
         d="m 1163.05,2568 v 238.9 h 40.99 l 113.01,-170.47 h 0.65 v 170.47 h 37.45 V 2568 h -36.82 l -117.19,174.01 h -0.65 V 2568 h -37.44"
         style="fill:#231f20;fill-opacity:1;fill-rule:nonzero;stroke:none"
         id="path110" />
      <path
         d="m 1522.03,2653.55 c 0,31.96 -13.56,55.21 -43.58,55.21 -28.74,0 -43.59,-20.67 -43.59,-55.21 0,-32.62 13.24,-55.86 43.59,-55.86 28.73,0 43.58,20.67 43.58,55.86 m -127.2,0 c 0,63.27 41.65,89.1 83.62,89.1 41.64,0 83.61,-25.83 83.61,-89.1 0,-62.63 -41.97,-89.11 -83.61,-89.11 -41.65,0 -83.62,26.48 -83.62,89.11"
         style="fill:#231f20;fill-opacity:1;fill-rule:nonzero;stroke:none"
         id="path112" />
      <path
         d="m 1596.91,2568 v 171.42 h 39.72 v -28.08 h 0.64 c 10.65,17.11 29.06,31.31 61.67,31.31 h 2.57 l -1.29,-36.48 c -1.93,0.32 -8.38,0.65 -10.64,0.65 -25.51,0 -41.66,-11.95 -52.95,-30.35 V 2568 h -39.72"
         style="fill:#231f20;fill-opacity:1;fill-rule:nonzero;stroke:none"
         id="path114" />
      <path
         d="m 1743.47,2612.87 v 94.92 h -29.7 v 31.64 h 29.7 v 59.72 h 39.71 v -59.72 h 44.23 v -31.64 h -44.23 v -84.91 c 0,-18.4 5.49,-25.83 25.18,-25.83 5.81,0 13.24,0.97 17.11,2.26 v -31.32 c -4.19,-0.96 -19.03,-2.26 -29.04,-2.26 -43.6,0 -52.96,16.14 -52.96,47.14"
         style="fill:#231f20;fill-opacity:1;fill-rule:nonzero;stroke:none"
         id="path116" />
      <path
         d="m 1860.01,2568 v 238.9 h 40.03 v -90.72 c 10.99,11.62 31.64,26.47 62.65,26.47 30.02,0 49.39,-17.75 49.39,-51.65 v -123 h -40.03 v 112.99 c 0,19.06 -8.08,27.77 -25.52,27.77 -17.43,0 -31.95,-9.05 -46.49,-22.28 V 2568 h -40.03"
         style="fill:#231f20;fill-opacity:1;fill-rule:nonzero;stroke:none"
         id="path118" />
      <path
         d="m 2180.25,2697.46 h 44.24 c 33.58,0 51.66,8.39 51.66,36.8 0,27.45 -17.77,35.83 -51.98,35.83 h -43.92 z M 2140.55,2568 v 238.9 h 85.54 c 56.83,0 89.76,-22.93 89.76,-71.68 0,-38.08 -19.69,-59.71 -52.94,-67.78 l 56.18,-99.44 h -43.27 l -53.59,94.26 h -41.98 V 2568 h -39.7"
         style="fill:#231f20;fill-opacity:1;fill-rule:nonzero;stroke:none"
         id="path120" />
      <path
         d="m 2358.77,2568 v 238.9 h 40.03 v -90.72 c 10.99,11.62 31.64,26.47 62.65,26.47 30.01,0 49.38,-17.75 49.38,-51.65 v -123 h -40.03 v 112.99 c 0,19.06 -8.07,27.77 -25.51,27.77 -17.43,0 -31.96,-9.05 -46.49,-22.28 V 2568 h -40.03"
         style="fill:#231f20;fill-opacity:1;fill-rule:nonzero;stroke:none"
         id="path122" />
      <path
         d="m 2555.05,2739.43 h 40.03 V 2568 h -40.03 z m -0.32,64.24 h 40.68 v -34.54 h -40.68 v 34.54"
         style="fill:#231f20;fill-opacity:1;fill-rule:nonzero;stroke:none"
         id="path124" />
      <path
         d="m 2641.56,2568 v 171.42 h 39.71 v -27.44 c 12.91,14.85 32.93,30.67 61.34,30.67 31.32,0 50.69,-16.14 50.69,-50.04 V 2568 h -39.71 v 113.32 c 0,18.73 -7.75,28.4 -25.83,28.4 -17.43,0 -31.96,-8.72 -46.49,-22.28 V 2568 h -39.71"
         style="fill:#231f20;fill-opacity:1;fill-rule:nonzero;stroke:none"
         id="path126" />
      <path
         d="m 2946.64,2670.34 c -2.26,26.15 -15.17,40.03 -39.06,40.03 -19.38,0 -37.13,-10.97 -41.01,-40.03 z m -120.42,-16.79 c 0,65.22 46.17,89.1 81.68,89.1 38.42,0 75.22,-22.92 75.22,-92.65 v -9.36 h -117.19 c 1.61,-31 20.66,-44.56 45.84,-44.56 22.28,0 35.19,7.42 48.11,20.02 l 20.98,-20.66 c -17.75,-19.69 -41.32,-30.99 -71.99,-30.99 -42.94,0 -82.65,26.14 -82.65,89.1"
         style="fill:#231f20;fill-opacity:1;fill-rule:nonzero;stroke:none"
         id="path128" />
      <path
         d="m 3013.46,2683.58 h 79.74 v -28.42 h -79.74 v 28.42"
         style="fill:#231f20;fill-opacity:1;fill-rule:nonzero;stroke:none"
         id="path130" />
      <path
         d="m 3164.54,2568 -63.6,238.9 h 40.68 l 30.35,-123.65 c 4.84,-19.04 9.36,-36.81 12.59,-55.53 h 0.64 c 3.23,18.4 7.43,36.16 12.27,55.21 l 28.74,123.97 h 38.74 l 29.7,-124.62 c 5.16,-20.34 9.04,-34.55 12.59,-54.56 h 0.65 c 3.55,20.67 7.1,33.25 11.62,53.6 l 29.7,125.58 h 37.77 L 3324.03,2568 h -35.19 l -42.94,183.05 h -0.65 L 3200.05,2568 h -35.51"
         style="fill:#231f20;fill-opacity:1;fill-rule:nonzero;stroke:none"
         id="path132" />
      <path
         d="m 3506.74,2670.34 c -2.26,26.15 -15.17,40.03 -39.06,40.03 -19.38,0 -37.13,-10.97 -41.01,-40.03 z m -120.42,-16.79 c 0,65.22 46.16,89.1 81.68,89.1 38.42,0 75.22,-22.92 75.22,-92.65 v -9.36 h -117.19 c 1.61,-31 20.66,-44.56 45.84,-44.56 22.28,0 35.19,7.42 48.11,20.02 l 20.98,-20.66 c -17.75,-19.69 -41.32,-30.99 -71.99,-30.99 -42.94,0 -82.65,26.14 -82.65,89.1"
         style="fill:#231f20;fill-opacity:1;fill-rule:nonzero;stroke:none"
         id="path134" />
      <path
         d="m 3561.93,2591.56 21.63,24.21 c 12.91,-10.97 31.96,-20.33 53.92,-20.33 21.3,0 34.22,5.48 34.22,19.69 0,13.88 -17.44,18.08 -38.1,22.92 -29.38,6.78 -64.57,14.53 -64.57,54.24 0,30.03 25.83,50.36 63.6,50.36 32.61,0 52.63,-9.36 70.38,-24.21 l -19.04,-25.83 c -12.6,10.33 -32.93,18.73 -48.43,18.73 -21.95,0 -29.06,-7.75 -29.06,-17.44 0,-13.88 17.11,-18.08 37.45,-22.6 29.38,-6.45 65.22,-13.88 65.22,-53.91 0,-36.16 -32.61,-52.95 -71.67,-52.95 -31.64,0 -60.05,11.3 -75.55,27.12"
         style="fill:#231f20;fill-opacity:1;fill-rule:nonzero;stroke:none"
         id="path136" />
      <path
         d="m 3754.01,2612.87 v 94.92 h -29.69 v 31.64 h 29.69 v 59.72 h 39.72 v -59.72 h 44.22 v -31.64 h -44.22 v -84.91 c 0,-18.4 5.48,-25.83 25.18,-25.83 5.81,0 13.24,0.97 17.11,2.26 v -31.32 c -4.19,-0.96 -19.04,-2.26 -29.05,-2.26 -43.6,0 -52.96,16.14 -52.96,47.14"
         style="fill:#231f20;fill-opacity:1;fill-rule:nonzero;stroke:none"
         id="path138" />
      <path
         d="m 3992.92,2653.55 c 0,36.15 -15.5,55.21 -41.01,55.21 -16.47,0 -32.29,-10.34 -41.65,-21.63 v -68.77 c 10.66,-13.88 26.16,-21.31 40.37,-21.31 30.01,0 42.29,18.41 42.29,56.5 m -122.36,-150.13 v 236.01 h 39.7 v -22.61 c 11.3,13.57 29.07,25.83 54.56,25.83 39.08,0 67.81,-29.37 67.81,-88.78 0,-59.4 -29.38,-88.46 -73.29,-88.46 -18.41,0 -36.48,7.43 -49.08,21.63 v -83.62 h -39.7"
         style="fill:#231f20;fill-opacity:1;fill-rule:nonzero;stroke:none"
         id="path140" />
      <path
         d="m 4067.8,2568 v 238.9 h 40.03 v -90.72 c 10.98,11.62 31.64,26.47 62.64,26.47 30.02,0 49.39,-17.75 49.39,-51.65 v -123 h -40.03 v 112.99 c 0,19.06 -8.07,27.77 -25.51,27.77 -17.43,0 -31.96,-9.05 -46.49,-22.28 V 2568 h -40.03"
         style="fill:#231f20;fill-opacity:1;fill-rule:nonzero;stroke:none"
         id="path142" />
      <path
         d="m 4363.19,2615.78 v 37.76 c -47.46,-6.44 -72.63,-18.07 -72.63,-36.79 0,-13.57 9.35,-20.67 23.88,-20.67 20.35,0 36.17,7.76 48.75,19.7 m -111.71,-6.47 c 0,37.13 31.65,62 111.71,71.04 v 5.16 c 0,17.11 -9.04,24.54 -28.09,24.54 -23.89,0 -43.25,-11.63 -57.79,-23.25 l -19.37,24.87 c 18.4,16.78 47.14,30.98 82.66,30.98 45.85,0 61.66,-21.95 61.66,-61.99 v -70.69 c 0,-20.67 1.29,-33.25 4.84,-41.97 h -40.04 c -2.26,7.09 -3.87,12.26 -3.87,21.95 -17.43,-17.76 -37.77,-24.53 -63.28,-24.53 -27.76,0 -48.43,15.49 -48.43,43.89"
         style="fill:#231f20;fill-opacity:1;fill-rule:nonzero;stroke:none"
         id="path144" />
      <path
         d="m 4446.47,2806.9 h 40.03 v -238.91 h -40.03 v 238.91"
         style="fill:#231f20;fill-opacity:1;fill-rule:nonzero;stroke:none"
         id="path146" />
      <path
         d="m 4534.27,2739.43 h 40.03 V 2568 h -40.03 z m -0.32,64.24 h 40.68 v -34.54 h -40.68 v 34.54"
         style="fill:#231f20;fill-opacity:1;fill-rule:nonzero;stroke:none"
         id="path148" />
      <path
         d="m 4721.19,2615.78 v 37.76 c -47.46,-6.44 -72.64,-18.07 -72.64,-36.79 0,-13.57 9.36,-20.67 23.89,-20.67 20.34,0 36.16,7.76 48.75,19.7 m -111.7,-6.47 c 0,37.13 31.63,62 111.7,71.04 v 5.16 c 0,17.11 -9.04,24.54 -28.08,24.54 -23.9,0 -43.27,-11.63 -57.8,-23.25 l -19.36,24.87 c 18.41,16.78 47.14,30.98 82.64,30.98 45.85,0 61.67,-21.95 61.67,-61.99 v -70.69 c 0,-20.67 1.29,-33.25 4.85,-41.97 h -40.05 c -2.26,7.09 -3.87,12.26 -3.87,21.95 -17.43,-17.76 -37.77,-24.53 -63.28,-24.53 -27.75,0 -48.42,15.49 -48.42,43.89"
         style="fill:#231f20;fill-opacity:1;fill-rule:nonzero;stroke:none"
         id="path150" />
    </g>
  </g>
</svg>
