{
    "edges": [
        {
            "dataRef": "080f87e5-3700-4cdd-8b87-7d9421461e22",
            "edgeId": 0,
            "edgeType": "undirected",
            "flux": 0,
            "label": "edge_0",
            "modelElementRef": "",
            "source": 0,
            "target": 1
        },
        {
            "dataRef": "9cfca5b0-eee8-47ef-8ec3-532ac5d0a8ee",
            "edgeId": 1,
            "edgeType": "undirected",
            "flux": 0,
            "label": "edge_1",
            "modelElementRef": "",
            "source": 1,
            "target": 2
        },
        {
            "dataRef": "91eb1942-b948-45d3-92af-12f1f32bd40f",
            "edgeId": 2,
            "edgeType": "undirected",
            "flux": 0,
            "label": "edge_2",
            "modelElementRef": "",
            "source": 2,
            "target": 3
        },
        {
            "dataRef": "2712aa5c-29cb-4742-9997-3c889135a961",
            "edgeId": 3,
            "edgeType": "undirected",
            "flux": 0,
            "label": "edge_3",
            "modelElementRef": "",
            "source": 3,
            "target": 4
        },
        {
            "dataRef": "f74fc559-39b9-4f0b-a0cb-6edefa16fbff",
            "edgeId": 4,
            "edgeType": "undirected",
            "flux": 0,
            "label": "edge_4",
            "modelElementRef": "",
            "source": 3,
            "target": 6
        },
        {
            "dataRef": "738aedf5-b4c7-4b77-a103-e296b9c8e60c",
            "edgeId": 5,
            "edgeType": "undirected",
            "flux": 0,
            "label": "edge_5",
            "modelElementRef": "",
            "source": 4,
            "target": 5
        },
        {
            "dataRef": "f659f30c-47d2-422f-bf74-8fa77af66ad7",
            "edgeId": 6,
            "edgeType": "undirected",
            "flux": 0,
            "label": "edge_6",
            "modelElementRef": "",
            "source": 4,
            "target": 7
        },
        {
            "dataRef": "c3c03282-0e6a-45f6-96ca-86ae5ea897fb",
            "edgeId": 7,
            "edgeType": "undirected",
            "flux": 0,
            "label": "edge_7",
            "modelElementRef": "",
            "source": 4,
            "target": 8
        },
        {
            "dataRef": "dd6fae6e-2ea9-48d1-ae8f-a6c0b5ba513a",
            "edgeId": 8,
            "edgeType": "undirected",
            "flux": 0,
            "label": "edge_8",
            "modelElementRef": "",
            "source": 4,
            "target": 9
        }
    ],
    "level": "module",
    "nodes": [
        {
            "dataRef": "997cda80-03c4-404d-98fa-da211ac4f4e8",
            "isSecondaryMetabolite": false,
            "label": "node_0",
            "modelElementRef": "",
            "nodeId": 0,
            "nodeType": "circle",
            "x": 27,
            "y": 37
        },
        {
            "dataRef": "1cdf31f0-e854-426d-85aa-f9124f8e664e",
            "isSecondaryMetabolite": false,
            "label": "node_1",
            "modelElementRef": "",
            "nodeId": 1,
            "nodeType": "circle",
            "x": 20,
            "y": 84
        },
        {
            "dataRef": "2600112f-5e81-4cde-ac7f-0d9faff511e3",
            "isSecondaryMetabolite": false,
            "label": "node_2",
            "modelElementRef": "",
            "nodeId": 2,
            "nodeType": "circle",
            "x": 73,
            "y": 24
        },
        {
            "dataRef": "eb8fc797-bb8a-4c3e-bf90-bb889e109f7b",
            "isSecondaryMetabolite": false,
            "label": "node_3",
            "modelElementRef": "",
            "nodeId": 3,
            "nodeType": "circle",
            "x": 3,
            "y": 83
        },
        {
            "dataRef": "bfa937aa-1781-43b6-a10d-b0301ee21870",
            "isSecondaryMetabolite": false,
            "label": "node_4",
            "modelElementRef": "",
            "nodeId": 4,
            "nodeType": "circle",
            "x": 10,
            "y": 71
        },
        {
            "dataRef": "9041e8d0-cfae-4494-b441-15e1f43a86c9",
            "isSecondaryMetabolite": false,
            "label": "node_5",
            "modelElementRef": "",
            "nodeId": 5,
            "nodeType": "circle",
            "x": 86,
            "y": 79
        },
        {
            "dataRef": "a95a605b-d81b-4c3c-87fa-253057a58b96",
            "isSecondaryMetabolite": false,
            "label": "node_6",
            "modelElementRef": "",
            "nodeId": 6,
            "nodeType": "circle",
            "x": 30,
            "y": 5
        },
        {
            "dataRef": "fccb4449-52ef-41eb-adb2-a752c608cda7",
            "isSecondaryMetabolite": false,
            "label": "node_7",
            "modelElementRef": "",
            "nodeId": 7,
            "nodeType": "circle",
            "x": 89,
            "y": 43
        },
        {
            "dataRef": "25bedf6e-9160-45f3-859f-adec630fda05",
            "isSecondaryMetabolite": false,
            "label": "node_8",
            "modelElementRef": "",
            "nodeId": 8,
            "nodeType": "circle",
            "x": 83,
            "y": 50
        },
        {
            "dataRef": "1c74291f-a526-4b52-88de-011417357522",
            "isSecondaryMetabolite": false,
            "label": "node_9",
            "modelElementRef": "",
            "nodeId": 9,
            "nodeType": "circle",
            "x": 75,
            "y": 84
        }
    ]
}