province,district,status,stage,GrupNone,Grup10-20,Grup>100,Grup20-30,Grup30-40,Grup40-50,Grup50-60,Grup60-70,Grup70-80,Grup80-90,Grup90-100,Grup<10
Jawa Barat,KOTA BANDUNG,ODP,Proses,0,54,0,224,153,90,59,32,8,0,0,22
Jawa Barat,KOTA BANDUNG,ODP,Selesai,0,0,0,4,2,0,0,0,0,0,0,0
Jawa Barat,KOTA BANDUNG,ODP,Meninggal,0,0,0,0,0,0,1,0,0,0,0,0
Jawa Barat,KOTA BANDUNG,PDP,Proses,0,0,0,0,0,1,0,1,1,0,0,0
Jawa Barat,KOTA CIREBON,ODP,Selesai,0,12,0,26,25,10,5,3,2,0,0,7
Jawa Barat,KOTA CIREBON,ODP,Proses,0,24,0,53,50,31,12,10,1,0,0,9
Jawa Barat,KOTA CIREBON,PDP,Selesai,0,0,0,3,6,1,0,0,0,0,0,0
Jawa Barat,KOTA CIREBON,OTG,Proses,0,0,0,1,0,1,2,0,0,0,0,0
Jawa Barat,KOTA CIREBON,PDP,Proses,0,0,0,0,0,0,1,0,0,0,0,0
Jawa Barat,KOTA CIREBON,OTG,Selesai,0,4,0,3,3,1,2,5,0,0,0,0
Jawa Barat,KOTA BOGOR,ODP,Selesai,0,106,0,240,218,185,129,64,27,5,0,62
Jawa Barat,KOTA BOGOR,PDP,Selesai,0,7,0,12,7,12,12,5,4,1,0,16
Jawa Barat,KOTA BOGOR,PDP,Meninggal,0,0,0,2,5,4,10,11,6,0,0,2
Jawa Barat,KOTA BOGOR,ODP,Proses,0,12,0,17,18,15,17,9,5,0,0,12
Jawa Barat,KOTA BOGOR,PDP,Proses,0,3,0,14,17,11,19,6,3,5,0,16
Jawa Barat,KOTA BOGOR,OTG,Selesai,0,16,0,32,19,16,8,3,2,0,0,5
Jawa Barat,KOTA BOGOR,OTG,Proses,0,18,0,21,15,15,7,4,1,0,0,11
Jawa Barat,KOTA SUKABUMI,PDP,Selesai,0,2,0,6,1,5,1,1,0,0,0,2
Jawa Barat,KOTA SUKABUMI,ODP,Proses,0,36,0,67,39,41,16,10,1,0,0,10
Jawa Barat,KOTA SUKABUMI,ODP,Selesai,0,0,0,2,4,3,1,0,0,0,0,0
Jawa Barat,KOTA SUKABUMI,PDP,Proses,0,0,0,1,2,1,1,0,0,0,0,1
Jawa Barat,KOTA SUKABUMI,PDP,Meninggal,0,0,0,0,0,0,0,1,1,0,0,1
Jawa Barat,KABUPATEN BOGOR,ODP,Proses,0,0,0,1,0,1,0,0,0,0,0,1
Jawa Barat,KABUPATEN BOGOR,ODP,Selesai,0,111,0,322,185,192,90,57,14,4,0,104
Jawa Barat,KABUPATEN BOGOR,PDP,Selesai,0,25,0,134,90,137,147,96,44,5,0,158
Jawa Barat,KABUPATEN BOGOR,PDP,Proses,0,0,0,0,1,1,1,0,0,0,0,1
Jawa Barat,KABUPATEN SUKABUMI,ODP,Selesai,0,54,0,112,78,58,22,4,5,0,0,20
Jawa Barat,KABUPATEN SUKABUMI,ODP,Proses,0,101,0,188,119,83,34,15,1,0,0,23
Jawa Barat,KABUPATEN SUKABUMI,PDP,Proses,0,2,0,2,1,0,0,1,0,0,0,0
Jawa Barat,KABUPATEN SUKABUMI,OTG,Proses,0,0,0,1,0,0,0,0,0,0,0,0
Jawa Barat,KABUPATEN CIANJUR,PDP,Proses,0,6,0,6,5,5,6,5,0,0,0,4
Jawa Barat,KABUPATEN CIANJUR,ODP,Selesai,0,73,0,168,109,79,24,7,5,1,0,30
Jawa Barat,KABUPATEN CIANJUR,ODP,Proses,0,46,0,77,53,40,25,6,3,0,1,24
Jawa Barat,KABUPATEN CIANJUR,PDP,Selesai,0,0,0,0,4,3,1,5,2,0,0,0
Jawa Barat,KABUPATEN CIANJUR,PDP,Meninggal,0,1,0,1,0,0,0,0,0,0,0,0
Jawa Barat,KABUPATEN CIREBON,PDP,Selesai,0,3,0,5,9,5,1,3,0,0,0,6
Jawa Barat,KABUPATEN CIREBON,ODP,Selesai,0,6,0,21,10,5,6,0,1,0,0,3
Jawa Barat,KABUPATEN CIREBON,PDP,Proses,0,0,0,3,6,8,1,0,0,0,0,1
Jawa Barat,KABUPATEN CIREBON,ODP,Proses,0,4,0,53,40,22,8,1,1,0,0,5
Jawa Barat,KABUPATEN CIREBON,OTG,Proses,0,0,0,0,1,0,0,0,0,0,0,0
Jawa Barat,KABUPATEN CIREBON,ODP,Meninggal,0,0,0,1,0,0,1,0,0,0,0,0
Jawa Barat,KABUPATEN CIREBON,PDP,Meninggal,0,0,0,1,0,1,3,1,0,0,0,1
Jawa Barat,KABUPATEN KUNINGAN,ODP,Selesai,0,37,0,74,39,52,23,15,4,1,0,21
Jawa Barat,KABUPATEN KUNINGAN,PDP,Selesai,0,0,0,1,2,1,0,0,0,0,0,0
Jawa Barat,KABUPATEN KUNINGAN,ODP,Proses,0,0,0,2,0,0,0,0,0,0,0,0
Jawa Barat,KABUPATEN INDRAMAYU,PDP,Selesai,0,0,0,3,3,0,1,0,0,0,0,1
Jawa Barat,KABUPATEN INDRAMAYU,ODP,Selesai,0,18,0,31,31,14,11,4,1,0,0,2
Jawa Barat,KABUPATEN INDRAMAYU,ODP,Proses,0,3,0,10,4,3,2,1,0,0,0,3
Jawa Barat,KABUPATEN INDRAMAYU,PDP,Proses,0,0,0,0,1,0,0,1,0,0,0,0
Jawa Barat,KABUPATEN INDRAMAYU,PDP,Meninggal,0,0,0,0,0,0,0,1,0,0,0,0
Jawa Barat,KABUPATEN INDRAMAYU,OTG,Selesai,0,2,0,18,29,15,6,2,0,0,0,0
Jawa Barat,KABUPATEN MAJALENGKA,PDP,Selesai,0,1,0,4,3,2,3,3,0,0,0,6
Jawa Barat,KABUPATEN MAJALENGKA,ODP,Selesai,0,60,0,149,77,67,29,13,5,2,0,25
Jawa Barat,KABUPATEN MAJALENGKA,ODP,Proses,0,14,0,32,26,18,11,3,1,0,0,1
Jawa Barat,KABUPATEN MAJALENGKA,PDP,Proses,0,2,0,2,3,2,2,0,1,0,0,2
Jawa Barat,KABUPATEN MAJALENGKA,PDP,Meninggal,0,0,0,4,1,0,1,0,0,0,0,0
Jawa Barat,KABUPATEN MAJALENGKA,OTG,Proses,0,4,0,3,14,11,6,2,2,0,1,4
Jawa Barat,KABUPATEN MAJALENGKA,OTG,Selesai,0,0,0,1,1,0,0,0,0,0,0,1
Jawa Barat,KABUPATEN BEKASI,ODP,Selesai,0,138,0,253,216,199,84,36,8,4,0,66
Jawa Barat,KABUPATEN BEKASI,PDP,Proses,0,2,0,8,3,9,3,0,0,0,0,5
Jawa Barat,KABUPATEN BEKASI,ODP,Proses,0,81,0,205,147,126,79,22,4,1,0,53
Jawa Barat,KABUPATEN BEKASI,PDP,Meninggal,0,1,0,4,4,20,12,12,2,0,0,5
Jawa Barat,KABUPATEN KARAWANG,ODP,Proses,0,173,1,578,505,342,187,24,3,0,0,50
Jawa Barat,KABUPATEN KARAWANG,PDP,Selesai,0,2,0,0,1,1,4,0,0,0,0,1
Jawa Barat,KABUPATEN KARAWANG,ODP,Selesai,0,10,0,97,118,83,33,15,5,1,0,11
Jawa Barat,KABUPATEN KARAWANG,PDP,Proses,0,5,0,10,10,9,11,2,2,0,0,10
Jawa Barat,KABUPATEN KARAWANG,OTG,Proses,0,6,0,27,20,10,8,0,0,0,0,2
Jawa Barat,KABUPATEN KARAWANG,OTG,Selesai,0,2,0,2,3,0,0,0,0,0,0,1
Jawa Barat,KABUPATEN KARAWANG,PDP,Meninggal,0,0,0,0,0,0,1,0,0,0,0,0
Jawa Barat,KABUPATEN PURWAKARTA,ODP,Proses,0,21,0,45,33,27,11,3,2,0,0,10
Jawa Barat,KABUPATEN PURWAKARTA,ODP,Selesai,0,23,0,80,64,41,27,15,5,1,0,9
Jawa Barat,KABUPATEN PURWAKARTA,PDP,Selesai,0,1,0,5,5,2,7,1,5,0,0,7
Jawa Barat,KABUPATEN PURWAKARTA,PDP,Proses,0,1,0,3,3,3,5,1,0,0,0,2
Jawa Barat,KABUPATEN SUBANG,ODP,Selesai,0,234,1,528,449,247,84,26,11,2,0,55
Jawa Barat,KABUPATEN SUBANG,ODP,Proses,0,406,1,908,709,376,177,48,15,1,0,94
Jawa Barat,KABUPATEN SUBANG,PDP,Selesai,0,1,0,3,0,3,0,1,0,0,0,0
Jawa Barat,KABUPATEN SUBANG,PDP,Proses,0,0,0,3,2,0,2,0,0,0,0,0
Jawa Barat,KABUPATEN SUBANG,OTG,Selesai,0,22,0,18,23,17,22,11,3,0,0,3
Jawa Barat,KABUPATEN SUBANG,OTG,Proses,0,4,0,1,3,1,2,0,0,0,0,1
Jawa Barat,KABUPATEN BANDUNG,ODP,Proses,0,1,0,0,1,0,0,0,0,0,0,1
Jawa Barat,KABUPATEN BANDUNG,ODP,Selesai,0,0,0,4,3,0,0,0,0,0,0,0
Jawa Barat,KABUPATEN BANDUNG,PDP,Selesai,0,1,0,1,0,0,1,1,2,0,0,0
Jawa Barat,KABUPATEN BANDUNG,PDP,Meninggal,0,0,0,0,1,0,1,3,0,0,0,0
Jawa Barat,KABUPATEN BANDUNG,PDP,Proses,0,2,0,3,2,3,3,0,1,0,0,2
Jawa Barat,KABUPATEN GARUT,ODP,Proses,0,383,0,770,446,363,209,66,14,0,0,182
Jawa Barat,KABUPATEN BANDUNG,OTG,Selesai,0,0,0,0,3,0,0,0,0,0,0,0
Jawa Barat,KABUPATEN SUMEDANG,ODP,Proses,0,119,0,250,176,151,76,42,9,0,0,66
Jawa Barat,KABUPATEN SUMEDANG,PDP,Proses,0,3,0,4,1,2,0,0,0,1,0,0
Jawa Barat,KABUPATEN SUMEDANG,PDP,Selesai,0,1,0,7,3,6,3,3,2,1,0,1
Jawa Barat,KABUPATEN SUMEDANG,OTG,Proses,0,4,0,7,4,5,10,5,1,0,0,6
Jawa Barat,KABUPATEN GARUT,PDP,Selesai,0,1,0,0,1,1,0,0,0,1,0,0
Jawa Barat,KABUPATEN GARUT,PDP,Meninggal,0,0,0,0,2,1,3,0,0,0,0,1
Jawa Barat,KABUPATEN GARUT,PDP,Proses,0,3,0,7,2,2,5,4,0,1,0,13
Jawa Barat,KABUPATEN GARUT,ODP,Selesai,0,10,0,27,7,16,7,1,1,0,0,1
Jawa Barat,KOTA TASIKMALAYA,ODP,Proses,0,17,4,65,69,33,21,6,2,0,0,15
Jawa Barat,KABUPATEN GARUT,OTG,Proses,0,17,0,88,72,61,35,8,0,0,0,20
Jawa Barat,KABUPATEN TASIKMALAYA,ODP,Proses,0,199,0,385,280,223,139,39,2,0,0,81
Jawa Barat,KABUPATEN TASIKMALAYA,PDP,Selesai,0,1,0,2,3,0,0,0,0,0,0,2
Jawa Barat,KABUPATEN TASIKMALAYA,PDP,Meninggal,0,1,0,0,1,3,2,0,0,0,0,1
Jawa Barat,KABUPATEN TASIKMALAYA,ODP,Selesai,0,30,0,63,53,41,40,10,3,1,0,13
Jawa Barat,KABUPATEN TASIKMALAYA,PDP,Proses,0,1,0,3,3,1,2,3,0,0,0,2
Jawa Barat,KABUPATEN TASIKMALAYA,OTG,Selesai,0,0,0,0,0,3,3,0,0,0,0,0
Jawa Barat,KABUPATEN CIAMIS,ODP,Selesai,0,273,1,537,310,260,249,109,22,0,0,69
Jawa Barat,KABUPATEN CIAMIS,ODP,Proses,0,10,0,41,14,11,10,5,1,0,0,9
Jawa Barat,KABUPATEN CIAMIS,PDP,Selesai,0,6,0,2,5,3,6,1,0,0,0,7
Jawa Barat,KABUPATEN CIAMIS,PDP,Meninggal,0,1,0,0,1,0,6,0,1,0,0,1
Jawa Barat,KABUPATEN CIAMIS,PDP,Proses,0,1,0,4,4,0,2,7,2,0,0,1
Jawa Barat,KABUPATEN CIAMIS,OTG,Proses,0,32,0,105,111,99,86,20,9,40,0,10
Jawa Barat,KABUPATEN CIAMIS,OTG,Selesai,0,20,0,38,40,16,28,6,3,8,0,8
Jawa Barat,KOTA BEKASI,ODP,Selesai,0,42,0,167,129,88,60,18,3,0,0,35
Jawa Barat,KOTA BEKASI,PDP,Selesai,0,13,0,28,23,17,21,10,4,0,0,7
Jawa Barat,KOTA BEKASI,PDP,Proses,0,37,0,127,119,120,100,48,16,3,1,28
Jawa Barat,KOTA BEKASI,ODP,Proses,0,81,0,275,189,134,91,24,2,1,0,42
Jawa Barat,KOTA BEKASI,PDP,Meninggal,0,0,0,2,7,14,21,6,1,0,0,2
Jawa Barat,KOTA BEKASI,OTG,Selesai,0,17,0,53,126,158,64,2,1,0,0,2
Jawa Barat,KOTA DEPOK,ODP,Selesai,0,0,0,1,0,1,0,0,0,0,0,0
Jawa Barat,KOTA DEPOK,ODP,Proses,0,0,0,0,0,0,1,0,0,0,0,0
Jawa Barat,KOTA TASIKMALAYA,PDP,Selesai,0,3,0,1,2,5,7,2,0,1,0,5
Jawa Barat,KOTA TASIKMALAYA,ODP,Selesai,0,107,134,203,178,155,84,37,9,0,0,42
Jawa Barat,KOTA TASIKMALAYA,PDP,Proses,0,0,3,4,3,14,6,6,1,4,0,3
Jawa Barat,KOTA TASIKMALAYA,PDP,Meninggal,0,0,0,0,1,0,0,5,0,0,0,0
Jawa Barat,KOTA TASIKMALAYA,OTG,Proses,0,1,0,1,4,0,2,0,0,0,0,0
Jawa Barat,KOTA TASIKMALAYA,OTG,Selesai,0,3,0,11,5,12,3,3,0,0,0,6
Jawa Barat,KOTA CIMAHI,OTG,Selesai,0,37,0,133,138,93,85,17,3,3,0,12
Jawa Barat,KOTA CIMAHI,ODP,Selesai,0,34,0,53,55,51,51,26,10,2,0,25
Jawa Barat,KOTA CIMAHI,PDP,Selesai,0,0,0,2,2,4,1,3,0,0,0,2
Jawa Barat,KOTA CIMAHI,ODP,Proses,0,4,0,21,19,12,10,8,5,1,0,7
Jawa Barat,KOTA CIMAHI,OTG,Proses,0,10,0,17,22,18,16,4,2,1,0,4
Jawa Barat,KOTA CIMAHI,PDP,Proses,0,3,0,2,2,2,1,0,1,1,0,4
Jawa Barat,KOTA BANJAR,PDP,Selesai,0,2,0,5,0,3,2,0,0,0,0,0
Jawa Barat,KOTA BANJAR,ODP,Selesai,0,24,0,100,63,33,22,11,2,1,0,10
Jawa Barat,KOTA BANJAR,PDP,Proses,0,9,0,9,9,5,7,4,4,3,0,7
Jawa Barat,KOTA BANJAR,ODP,Proses,0,28,0,59,37,20,12,2,2,0,0,11
Jawa Barat,KOTA BANJAR,OTG,Selesai,0,11,0,7,8,26,10,5,0,1,0,3
Jawa Barat,KOTA BANJAR,OTG,Proses,0,3,0,8,4,4,3,1,0,0,0,0
Jawa Barat,KOTA BANJAR,PDP,Meninggal,0,2,0,1,0,1,2,3,2,0,0,1
Jawa Barat,KABUPATEN BANDUNG BARAT,PDP,Selesai,0,1,0,1,2,0,0,0,0,0,0,1
Jawa Barat,KABUPATEN BANDUNG BARAT,ODP,Selesai,0,23,0,79,72,43,27,5,0,0,0,15
Jawa Barat,KABUPATEN BANDUNG BARAT,OTG,Selesai,0,18,0,30,41,32,22,5,1,0,0,24
Jawa Barat,KABUPATEN BANDUNG BARAT,OTG,Proses,0,6,0,11,8,12,9,2,0,0,0,5
Jawa Barat,KABUPATEN BANDUNG BARAT,ODP,Proses,0,64,0,188,160,123,71,31,7,0,0,58
Jawa Barat,KABUPATEN BANDUNG BARAT,PDP,Meninggal,0,0,0,0,1,0,1,1,0,0,0,0
Jawa Barat,KABUPATEN BANDUNG BARAT,PDP,Proses,0,1,0,1,0,3,3,2,0,0,0,4
Jawa Barat,KABUPATEN PANGANDARAN,ODP,Selesai,0,83,0,194,79,69,37,22,7,2,0,18
Jawa Barat,KABUPATEN PANGANDARAN,ODP,Proses,0,1,0,7,4,2,1,0,0,0,0,1
Jawa Barat,KABUPATEN PANGANDARAN,PDP,Meninggal,0,0,0,0,0,0,1,2,0,0,0,0
Jawa Barat,KABUPATEN PANGANDARAN,PDP,Selesai,0,1,0,0,0,0,0,1,1,0,0,0
Jawa Barat,KABUPATEN PANGANDARAN,OTG,Selesai,0,4,0,7,13,14,12,7,0,0,0,1
Jawa Barat,KABUPATEN PANGANDARAN,OTG,Proses,0,0,0,0,1,2,1,0,0,0,0,0
Jawa Barat,KABUPATEN PANGANDARAN,PDP,Proses,0,0,0,1,0,0,0,0,0,0,0,0
Jawa Barat,KOTA DEPOK,Positif,Sembuh,2,1,0,2,6,8,12,2,1,0,0,0
Jawa Barat,KOTA BANDUNG,Positif,Sembuh,1,0,0,5,3,3,8,0,0,0,0,1
Jawa Barat,KABUPATEN BEKASI,Positif,Sembuh,0,1,0,2,2,15,9,1,0,0,0,0
Jawa Barat,KABUPATEN CIREBON,Positif,Sembuh,0,0,0,1,1,0,0,0,0,0,0,0
Jawa Barat,KABUPATEN BEKASI,Positif,Meninggal,0,0,0,0,1,1,3,2,0,0,0,0
Jawa Barat,KOTA BEKASI,Positif,Sembuh,0,2,0,6,4,4,3,1,0,0,0,0
Jawa Barat,KABUPATEN PURWAKARTA,Positif,Sembuh,0,0,0,0,0,1,1,1,0,0,0,1
Jawa Barat,KABUPATEN BOGOR,Positif,Meninggal,0,0,0,0,0,0,2,2,0,0,0,0
Jawa Barat,KABUPATEN BOGOR,Positif,Sembuh,0,0,0,2,2,1,0,0,0,0,0,0
Jawa Barat,KOTA DEPOK,Positif,Proses,15,10,0,28,41,48,29,20,3,1,0,7
Jawa Barat,KABUPATEN BANDUNG,Positif,Meninggal,0,0,0,0,0,1,2,1,0,0,0,0
Jawa Barat,KABUPATEN BOGOR,Positif,Proses,5,3,0,10,20,14,8,5,2,1,0,2
Jawa Barat,KABUPATEN KUNINGAN,Positif,Meninggal,0,1,0,0,0,0,1,0,0,0,0,0
Jawa Barat,KOTA BEKASI,Positif,Proses,5,9,0,41,46,46,55,23,2,2,0,1
Jawa Barat,KOTA DEPOK,Positif,Meninggal,2,0,0,0,1,2,6,1,2,0,0,0
Jawa Barat,KOTA BANDUNG,Positif,Meninggal,3,0,0,0,1,3,10,8,2,1,1,0
Jawa Barat,KOTA BANDUNG,Positif,Proses,30,1,0,15,24,19,45,20,3,1,0,5
Jawa Barat,KOTA BOGOR,Positif,Proses,2,1,0,4,7,12,14,8,2,1,0,0
Jawa Barat,KOTA BOGOR,Positif,Sembuh,1,0,0,0,1,6,2,0,0,0,0,0
Jawa Barat,KOTA BOGOR,Positif,Meninggal,1,0,0,0,1,1,4,2,1,0,0,0
Jawa Barat,KABUPATEN BANDUNG,Positif,Sembuh,0,1,0,0,1,0,4,0,0,0,0,0
Jawa Barat,KOTA BEKASI,Positif,Meninggal,1,0,0,0,0,0,2,1,0,0,0,0
Jawa Barat,KOTA CIMAHI,Positif,Meninggal,0,0,0,0,0,1,1,1,0,0,0,0
Jawa Barat,KOTA CIMAHI,Positif,Sembuh,0,0,0,0,2,4,1,1,1,0,0,0
Jawa Barat,KABUPATEN SUKABUMI,Positif,Sembuh,0,0,0,0,1,1,0,0,0,0,0,0
Jawa Barat,KABUPATEN BEKASI,Positif,Proses,1,1,0,8,8,11,7,0,3,0,0,1
Jawa Barat,KABUPATEN BANDUNG BARAT,Positif,Meninggal,0,0,0,0,1,0,0,2,0,0,0,0
Jawa Barat,KABUPATEN KUNINGAN,Positif,Sembuh,0,0,0,1,0,1,0,0,0,0,0,0
Jawa Barat,KOTA TASIKMALAYA,Positif,Sembuh,0,0,0,0,1,0,0,1,0,0,0,0
Jawa Barat,KABUPATEN SUMEDANG,Positif,Proses,0,0,0,0,4,1,2,0,0,0,0,0
Jawa Barat,KABUPATEN BANDUNG,Positif,Proses,10,1,0,2,7,9,9,2,1,0,0,0
Jawa Barat,KABUPATEN MAJALENGKA,Positif,Meninggal,0,0,0,0,0,0,1,0,0,0,0,0
Jawa Barat,KOTA CIMAHI,Positif,Proses,11,2,0,9,7,6,8,1,1,0,0,0
Jawa Barat,KABUPATEN KARAWANG,Positif,Sembuh,0,1,0,0,3,3,4,0,0,0,0,0
Jawa Barat,KABUPATEN GARUT,Positif,Proses,1,0,0,1,2,2,0,0,0,0,0,0
Jawa Barat,KABUPATEN BANDUNG BARAT,Positif,Proses,5,0,0,2,6,7,5,4,2,0,0,1
Jawa Barat,KOTA SUKABUMI,Positif,Sembuh,0,0,0,0,0,3,1,0,0,0,0,0
Jawa Barat,KOTA TASIKMALAYA,Positif,Proses,3,0,0,0,3,2,1,1,0,0,0,0
Jawa Barat,KOTA SUKABUMI,Positif,Proses,10,1,0,5,4,11,3,0,0,0,0,0
Jawa Barat,KOTA BANJAR,Positif,Sembuh,0,1,0,0,0,0,0,0,0,0,0,0
Jawa Barat,KABUPATEN CIAMIS,Positif,Sembuh,0,0,0,0,0,0,1,0,1,0,0,0
Jawa Barat,KABUPATEN SUBANG,Positif,Proses,1,0,0,2,5,1,3,0,0,0,0,0
Jawa Barat,KABUPATEN PURWAKARTA,Positif,Proses,4,0,0,1,2,3,3,3,0,0,0,0
Jawa Barat,KABUPATEN INDRAMAYU,Positif,Sembuh,0,0,0,1,0,0,0,0,0,0,0,0
Jawa Barat,KABUPATEN SUKABUMI,Positif,Proses,2,1,0,0,0,3,4,0,0,0,0,0
Jawa Barat,KOTA CIREBON,Positif,Meninggal,0,0,0,0,0,0,0,0,1,0,0,0
Jawa Barat,KABUPATEN CIREBON,Positif,Proses,1,0,0,0,0,1,1,0,0,0,0,0
Jawa Barat,KABUPATEN SUBANG,Positif,Sembuh,0,0,0,0,1,0,0,0,0,0,0,0
Jawa Barat,KOTA BANJAR,Positif,Proses,0,0,0,0,0,0,1,0,0,1,0,0
Jawa Barat,KABUPATEN CIANJUR,Positif,Meninggal,0,0,0,1,0,0,0,0,0,0,0,0
Jawa Barat,KABUPATEN SUBANG,Positif,Meninggal,1,0,0,0,0,0,0,0,0,0,0,0
Jawa Barat,KABUPATEN KUNINGAN,Positif,Proses,1,0,0,0,0,0,1,0,0,0,0,0
Jawa Barat,KABUPATEN KARAWANG,Positif,Proses,0,0,0,0,0,0,1,0,0,0,0,0
Jawa Barat,KABUPATEN INDRAMAYU,Positif,Proses,0,0,0,0,1,0,1,0,0,0,0,0
Jawa Barat,KABUPATEN MAJALENGKA,Positif,Proses,0,0,0,0,1,0,0,0,0,0,0,0
Jawa Barat,KABUPATEN CIAMIS,Positif,Proses,0,1,0,0,0,2,0,0,0,0,0,0
Jawa Barat,KOTA TASIKMALAYA,Positif,Meninggal,0,0,0,0,0,0,1,0,0,0,0,0
Jawa Barat,KABUPATEN CIANJUR,Positif,Proses,0,0,0,1,0,0,1,1,0,0,0,0
Jawa Barat,KABUPATEN PANGANDARAN,Positif,Proses,0,0,0,0,0,0,0,1,0,0,0,0
Jawa Barat,KABUPATEN INDRAMAYU,Positif,Meninggal,2,0,0,0,0,0,0,0,0,0,0,0
Jawa Barat,KOTA CIREBON,Positif,Proses,0,0,0,0,0,0,0,2,0,0,0,0
Jawa Barat,KABUPATEN TASIKMALAYA,Positif,Proses,0,0,0,0,0,1,0,0,0,0,0,0