date,prov_id,province,odp,pdp,new_cases,new_recovered,new_deaths,prev_cases,prev_recovered,prev_deaths,%_growth_cases,%_growth_recovered,%_growth_deaths,active_cases,supsmuCumulativePredictions,supsmuDailyPredictions,firstDerivative,secondDerivative,cases,recovered,deaths
06/03/2020,32,Jawa Barat,285,43,3,0,0,,,,,,,3,3,0,0,0,3,0,0
07/03/2020,32,Jawa Barat,202,5,0,0,0,3,0,0,0.00%,,,3,3,0,0,0,3,0,0
08/03/2020,32,Jawa Barat,0,0,0,0,0,3,0,0,0.00%,,,3,3,0,0,0,3,0,0
09/03/2020,32,Jawa Barat,48,2,0,0,0,3,0,0,0.00%,,,3,3,0.0311418679964996,0,0,3,0,0
10/03/2020,32,Jawa Barat,59,4,0,0,0,3,0,0,0.00%,,,3,3,0.154209916708593,0,0,3,0,0
11/03/2020,32,Jawa Barat,68,8,0,0,0,3,0,0,0.00%,,,3,3.28,0.560565162598094,0,0,3,0,0
12/03/2020,32,Jawa Barat,24,4,0,0,0,3,0,0,0.00%,,,3,3.88,1.12803920694361,0,0,3,0,0
13/03/2020,32,Jawa Barat,43,2,0,1,0,3,0,0,0.00%,,,2,4.8,1.81966549836851,0,0,3,1,0
14/03/2020,32,Jawa Barat,1,15,0,0,0,3,1,0,0.00%,0.00%,,2,6.52,2.54280403757284,0,0,3,1,0
15/03/2020,32,Jawa Barat,76,1,7,0,2,3,1,0,233.33%,0.00%,,7,9.24,3.33907887545385,7,7,10,1,2
16/03/2020,32,Jawa Barat,76,6,1,2,0,10,1,2,10.00%,200.00%,0.00%,6,12.96,3.93006631884171,-6,-13,11,3,2
17/03/2020,32,Jawa Barat,187,16,0,0,0,11,3,2,0.00%,0.00%,0.00%,6,18.16,4.60759042817356,-1,5,11,3,2
18/03/2020,32,Jawa Barat,53,20,12,0,0,11,3,2,109.09%,0.00%,0.00%,18,25,5.38340292755765,12,13,23,3,2
19/03/2020,32,Jawa Barat,343,48,5,0,1,23,3,2,21.74%,0.00%,50.00%,22,32.76,6.31039611770629,-7,-19,28,3,3
20/03/2020,32,Jawa Barat,128,13,14,1,3,28,3,3,50.00%,33.33%,100.00%,32,41.08,7.4021232794917,9,16,42,4,6
21/03/2020,32,Jawa Barat,312,47,14,1,0,42,4,6,33.33%,25.00%,0.00%,45,49.64,8.64776790189037,0,-9,56,5,6
22/03/2020,32,Jawa Barat,67,40,4,0,2,56,5,6,7.14%,0.00%,33.33%,47,57.56,9.8856774892727,-10,-10,60,5,8
23/03/2020,32,Jawa Barat,555,133,6,0,1,60,5,8,10.00%,0.00%,12.50%,52,65.28,11.1334991006083,2,12,66,5,9
24/03/2020,32,Jawa Barat,283,68,1,0,1,66,5,9,1.52%,0.00%,11.11%,52,73.44,12.2108449687173,-5,-7,67,5,10
25/03/2020,32,Jawa Barat,987,127,13,0,0,67,5,10,19.40%,0.00%,0.00%,65,82.72,13.1270750709061,12,17,80,5,10
26/03/2020,32,Jawa Barat,116,8,5,0,1,80,5,10,6.25%,0.00%,10.00%,69,93.88,13.8685345693299,-8,-20,85,5,11
27/03/2020,32,Jawa Barat,1175,72,19,0,2,85,5,11,22.35%,0.00%,18.18%,86,107.76,14.6475024376936,14,22,104,5,13
28/03/2020,32,Jawa Barat,594,89,16,1,3,104,5,13,15.38%,20.00%,23.08%,98,124,15.3026350796116,-3,-17,120,6,16
29/03/2020,32,Jawa Barat,1599,80,14,3,3,120,6,16,11.67%,50.00%,18.75%,106,142.2,16.184544404766,-2,1,134,9,19
30/03/2020,32,Jawa Barat,4203,152,31,0,1,134,9,19,23.13%,0.00%,5.26%,136,161.36,17.0375210706443,17,19,165,9,20
31/03/2020,32,Jawa Barat,1415,55,17,0,0,165,9,20,10.30%,0.00%,0.00%,153,180.28,17.8847750855513,-14,-31,182,9,20
01/04/2020,32,Jawa Barat,1632,77,25,2,1,182,9,20,13.74%,22.22%,5.00%,175,198.04,18.505491970186,8,22,207,11,21
02/04/2020,32,Jawa Barat,1594,68,16,0,0,207,11,21,7.73%,0.00%,0.00%,191,213.84,19.0940732850977,-9,-17,223,11,21
03/04/2020,32,Jawa Barat,790,252,2,1,4,223,11,21,0.90%,9.09%,19.05%,188,230.16,19.7868778278183,-14,-5,225,12,25
04/04/2020,32,Jawa Barat,4622,218,19,0,3,225,12,25,8.44%,0.00%,12.00%,204,248.24,20.5655753703469,17,31,244,12,28
05/04/2020,32,Jawa Barat,964,78,6,0,0,244,12,28,2.46%,0.00%,0.00%,210,268.2,21.32849791505,-13,-30,250,12,28
06/04/2020,32,Jawa Barat,1046,273,11,1,1,250,12,28,4.40%,8.33%,3.57%,219,290.64,22.19630911188,5,18,261,13,29
07/04/2020,32,Jawa Barat,2206,186,78,4,0,261,13,29,29.89%,30.77%,0.00%,293,317.08,23.041628959276,67,62,339,17,29
08/04/2020,32,Jawa Barat,446,147,21,0,6,339,17,29,6.19%,0.00%,20.69%,308,343.12,23.6173542720255,-57,-124,360,17,35
09/04/2020,32,Jawa Barat,1741,259,10,2,5,360,17,35,2.78%,11.76%,14.29%,311,371.28,24.0515659657528,-11,46,370,19,40
10/04/2020,32,Jawa Barat,1300,117,10,0,0,370,19,40,2.70%,0.00%,0.00%,321,401.64,24.4603495696921,0,11,380,19,40
11/04/2020,32,Jawa Barat,231,70,35,0,0,380,19,40,9.21%,0.00%,0.00%,356,434.8,24.8352586283382,25,25,415,19,40
12/04/2020,32,Jawa Barat,843,75,30,0,2,415,19,40,7.23%,0.00%,5.00%,384,468.88,25.1472273977464,-5,-30,445,19,42
13/04/2020,32,Jawa Barat,883,118,103,3,11,445,19,42,23.15%,15.79%,26.19%,473,507,26.2352941176471,73,78,548,22,53
14/04/2020,32,Jawa Barat,465,94,3,1,0,548,22,53,0.55%,4.55%,0.00%,475,542.12,27.3694437050838,-100,-173,551,23,53
15/04/2020,32,Jawa Barat,545,154,29,0,0,551,23,53,5.26%,0.00%,0.00%,504,576.56,28.543305829119,26,126,580,23,53
16/04/2020,32,Jawa Barat,260,112,12,5,0,580,23,53,2.07%,21.74%,0.00%,511,609.56,29.809315943572,-17,-43,592,28,53
17/04/2020,32,Jawa Barat,1381,488,60,13,2,592,28,53,10.14%,46.43%,3.77%,556,641.92,31.0896992281075,48,65,652,41,55
18/04/2020,32,Jawa Barat,685,170,9,0,0,652,41,55,1.38%,0.00%,0.00%,565,670.28,31.5394729837636,-51,-99,661,41,55
19/04/2020,32,Jawa Barat,900,116,54,4,3,661,41,55,8.17%,9.76%,5.45%,612,698.96,31.756986957679,45,96,715,45,58
20/04/2020,32,Jawa Barat,884,125,29,11,4,715,45,58,4.06%,24.44%,6.90%,626,726.72,31.9653979238754,-25,-70,744,56,62
21/04/2020,32,Jawa Barat,477,184,9,19,6,744,56,62,1.21%,33.93%,9.68%,610,754.16,32.1999467660367,-20,5,753,75,68
22/04/2020,32,Jawa Barat,227,57,6,2,3,753,75,68,0.80%,2.67%,4.41%,611,781.48,32.4568361281164,-3,17,759,77,71
23/04/2020,32,Jawa Barat,600,130,23,8,3,759,77,71,3.03%,10.39%,4.23%,623,812.2,32.6772602253571,17,20,782,85,74
24/04/2020,32,Jawa Barat,572,162,74,5,3,782,85,74,9.46%,5.88%,4.05%,689,845.6,33.1903823973028,51,34,856,90,77
25/04/2020,32,Jawa Barat,614,117,44,3,0,856,90,77,5.14%,3.33%,0.00%,730,879.44,33.4345488421613,-30,-81,900,93,77
26/04/2020,32,Jawa Barat,293,171,11,0,0,900,93,77,1.22%,0.00%,0.00%,741,911.56,33.4343181616538,-33,-3,911,93,77
27/04/2020,32,Jawa Barat,480,64,40,3,1,911,93,77,4.39%,3.23%,1.30%,777,941.44,33.4936030520806,29,62,951,96,78
28/04/2020,32,Jawa Barat,290,169,19,7,1,951,96,78,2.00%,7.29%,1.28%,788,967.36,33.595510602431,-21,-50,970,103,79
29/04/2020,32,Jawa Barat,426,117,38,4,0,970,103,79,3.92%,3.88%,0.00%,822,989.16,34.2298465087393,19,40,1008,107,79
30/04/2020,32,Jawa Barat,525,174,5,37,4,1008,107,79,0.50%,34.58%,5.06%,786,1014.6,35.1768016194332,-33,-52,1013,144,83
01/05/2020,32,Jawa Barat,414,139,0,2,0,1013,144,83,0.00%,1.39%,0.00%,784,1047,36.2019301047402,-5,28,1013,146,83
02/05/2020,32,Jawa Barat,283,85,31,2,1,1013,146,83,3.06%,1.37%,1.20%,812,1087.6,37.2277072972557,31,36,1044,148,84
03/05/2020,32,Jawa Barat,485,332,11,4,1,1044,148,84,1.05%,2.70%,1.19%,818,1137.96,38.2745218049116,-20,-51,1055,152,85
04/05/2020,32,Jawa Barat,140,73,196,7,1,1055,152,85,18.58%,4.61%,1.18%,1006,1198.88,38.6563297984114,185,205,1251,159,86
05/05/2020,32,Jawa Barat,319,95,49,8,1,1251,159,86,3.92%,5.03%,1.16%,1046,1257.52,39.0414720591738,-147,-332,1300,167,87
06/05/2020,32,Jawa Barat,315,137,20,10,3,1300,167,87,1.54%,5.99%,3.45%,1053,1308.71584777477,39.4231735847471,-29,118,1320,177,90
07/05/2020,32,Jawa Barat,262,124,61,5,0,1320,177,90,4.62%,2.82%,0.00%,1109,1353.29259522371,39.8145636916353,41,70,1381,182,90
08/05/2020,32,Jawa Barat,353,80,23,2,2,1381,182,90,1.67%,1.10%,2.22%,1128,1390.34934268457,40.2267150441982,-38,-79,1404,184,92
09/05/2020,32,Jawa Barat,166,90,33,18,3,1404,184,92,2.35%,9.78%,3.26%,1140,1419.55432543909,40.6533992687335,10,48,1437,202,95
10/05/2020,32,Jawa Barat,273,121,0,0,0,1437,202,95,0.00%,0.00%,0.00%,1140,1449.60539810657,41.1859658462099,-33,-43,1437,202,95
11/05/2020,32,Jawa Barat,218,54,55,11,0,1437,202,95,3.83%,5.45%,0.00%,1184,1481.76724232378,41.7111358923382,55,88,1492,213,95
12/05/2020,32,Jawa Barat,232,73,56,0,3,1492,213,95,3.75%,0.00%,3.16%,1237,1514.33234175222,42.2035138083375,1,-54,1548,213,98
13/05/2020,32,Jawa Barat,314,63,8,24,0,1548,213,98,0.52%,11.27%,0.00%,1221,1547.14777231579,42.6640015732816,-48,-49,1556,237,98
14/05/2020,32,Jawa Barat,678,139,9,5,1,1556,237,98,0.58%,2.11%,1.02%,1224,1580.21147499442,43.1197987440988,1,49,1565,242,99
15/05/2020,32,Jawa Barat,221,84,31,17,1,1565,242,99,1.98%,7.02%,1.01%,1237,1611.49177143046,43.4513920749494,22,21,1596,259,100
16/05/2020,32,Jawa Barat,415,70,25,3,0,1596,259,100,1.57%,1.16%,0.00%,1259,1643.27430847405,43.7909555087813,-6,-28,1621,262,100
17/05/2020,32,Jawa Barat,214,105,31,58,10,1621,262,100,1.91%,22.14%,10.00%,1222,1675.78772682595,44.1384890455944,6,12,1652,320,110
18/05/2020,32,Jawa Barat,106,15,27,77,13,1652,320,110,1.63%,24.06%,11.82%,1159,1709.03202648618,44.4939926853889,-4,-10,1679,397,123
19/05/2020,32,Jawa Barat,174,86,21,14,1,1679,397,123,1.25%,3.53%,0.81%,1165,1742.64176680058,44.8534813766736,-6,-2,1700,411,124
20/05/2020,32,Jawa Barat,256,39,176,1,0,1700,411,124,10.35%,0.24%,0.00%,1340,1776.25150711497,45.2129700679583,155,161,1876,412,124