<svg width="20" height="21" viewBox="0 0 20 21" fill="none" xmlns="http://www.w3.org/2000/svg">
<path d="M9.99731 7.38119C8.16111 7.38119 6.66262 8.87967 6.66262 10.7159C6.66262 12.5521 8.16111 14.0506 9.99731 14.0506C11.8335 14.0506 13.332 12.5521 13.332 10.7159C13.332 8.87967 11.8335 7.38119 9.99731 7.38119ZM19.9989 10.7159C19.9989 9.33497 20.0114 7.96657 19.9338 6.58817C19.8563 4.98711 19.4911 3.56618 18.3203 2.39541C17.147 1.22214 15.7286 0.859402 14.1275 0.781851C12.7466 0.7043 11.3782 0.716809 9.99981 0.716809C8.61891 0.716809 7.25051 0.7043 5.8721 0.781851C4.27105 0.859402 2.85012 1.22464 1.67935 2.39541C0.506076 3.56868 0.143338 4.98711 0.0657868 6.58817C-0.0117642 7.96907 0.000744099 9.33747 0.000744099 10.7159C0.000744099 12.0943 -0.0117642 13.4652 0.0657868 14.8436C0.143338 16.4446 0.508578 17.8656 1.67935 19.0363C2.85262 20.2096 4.27105 20.5724 5.8721 20.6499C7.25301 20.7275 8.62141 20.7149 9.99981 20.7149C11.3807 20.7149 12.7491 20.7275 14.1275 20.6499C15.7286 20.5724 17.1495 20.2071 18.3203 19.0363C19.4936 17.8631 19.8563 16.4446 19.9338 14.8436C20.0139 13.4652 19.9989 12.0968 19.9989 10.7159ZM9.99731 15.8467C7.15795 15.8467 4.86644 13.5552 4.86644 10.7159C4.86644 7.87651 7.15795 5.58501 9.99731 5.58501C12.8367 5.58501 15.1282 7.87651 15.1282 10.7159C15.1282 13.5552 12.8367 15.8467 9.99731 15.8467ZM15.3383 6.57316C14.6754 6.57316 14.14 6.0378 14.14 5.37487C14.14 4.71193 14.6754 4.17658 15.3383 4.17658C16.0013 4.17658 16.5366 4.71193 16.5366 5.37487C16.5368 5.53229 16.5059 5.68819 16.4458 5.83367C16.3856 5.97914 16.2974 6.11132 16.1861 6.22263C16.0748 6.33394 15.9426 6.42219 15.7971 6.48234C15.6516 6.54249 15.4957 6.57335 15.3383 6.57316Z" fill="#FFFFFE"/>
</svg>
