{
  "version": 2,
  "env": {
    "GMAPS_KEY": "AIzaSyAqNDrJhXjrnDWLE3E4wd3kk3o0kXAjpfE"
  },
  "builds": [
    {
      "src": "nuxt.config.js",
      "use": "@nuxtjs/now-builder",
      "config": {}
    }
  ],
  "build": {
    "env": {
      "BASE_URL": "https://private-b1025c-needsmatchmakingbackend.apiary-mock.com",
      "GMAPS_KEY": "AIzaSyAqNDrJhXjrnDWLE3E4wd3kk3o0kXAjpfE"
    }
  }
}
