{
  "id": "pat-1",
  "caseNumber": "1",
  "caseStatus": "Sembuh",
  "createdDate": "2020-03-22T14:59:43.8487692+00:00",
  "updatedDate": "0001-01-01T00:00:00",
  "diagnosedDate": "0001-01-01T00:00:00",
  "dischargeDate": "0001-01-01T00:00:00",
  "deceasedDate": "0001-01-01T00:00:00",
  "sex": "P",
  "age": 31,
  "nationality": "WNI",
  "city": null,
  "province": "DKI JAKARTA"
}