{
    "scriptFile": "webhook.py",
    "bindings": [
        {
            "authLevel": "function",
            "type": "httpTrigger",
            "direction": "in",
            "name": "req",
            "methods": [
                "post"
            ]
        },
        {
            "type": "http",
            "direction": "out",
            "name": "$return"
        }
    ]
}