{
  "id": "eve-1",
  "place": "Place Name",
  "placeId": "Place ID",
  "name": "Event Name",
  "eventDate": "0001-01-01T00:00:00",
  "tag": "tag1,tag2",
  "city": "Jakarta",
  "province": "DKI Jakarta",
  "createdDate": "2020-03-22T14:59:43.8599145+00:00"
}