module gitlab.com/kawalcovid19/kawal-diri/authentication

go 1.14

require (
	github.com/cpuguy83/go-md2man/v2 v2.0.0 // indirect
	github.com/dgrijalva/jwt-go v3.2.0+incompatible
	github.com/go-ozzo/ozzo-validation/v4 v4.1.0
	github.com/golang/glog v0.0.0-20160126235308-23def4e6c14b
	github.com/golang/protobuf v1.3.5
	github.com/gorilla/mux v1.7.4
	github.com/grpc-ecosystem/grpc-gateway v1.14.3
	github.com/jinzhu/gorm v1.9.12
	github.com/joho/godotenv v1.3.0
	github.com/pkg/errors v0.9.1
	github.com/rakyll/statik v0.1.7
	github.com/urfave/cli/v2 v2.2.0
	golang.org/x/crypto v0.0.0-20191205180655-e7c4368fe9dd
	golang.org/x/net v0.0.0-20200320220750-118fecf932d8 // indirect
	golang.org/x/sys v0.0.0-20200321134203-328b4cd54aae // indirect
	golang.org/x/text v0.3.2 // indirect
	google.golang.org/genproto v0.0.0-20200319113533-08878b785e9c
	google.golang.org/grpc v1.28.0
)
