		Exception Details on  29/01/1396 01:56:06 ب.ظ
-------------------------------------------------------------------------------------
Error 	: مجوز ورود شما تائید نشد - خطای ورود کاربر

------------------------------------*END*--------------------------------------------
		Exception Details on  29/01/1396 01:56:06 ب.ظ
-------------------------------------------------------------------------------------
Error 	: مجوز ورود شما تائید نشد - خطای ورود کاربر

------------------------------------*END*--------------------------------------------
		Exception Details on  29/01/1396 06:03:53 ب.ظ
-------------------------------------------------------------------------------------
Error 	: مجوز ورود شما تائید نشد - خطای ورود کاربر

------------------------------------*END*--------------------------------------------
		Exception Details on  29/01/1396 06:03:53 ب.ظ
-------------------------------------------------------------------------------------
Error 	: مجوز ورود شما تائید نشد - خطای ورود کاربر

------------------------------------*END*--------------------------------------------
