		Exception Details on  14/06/1395 12:42:22 ق.ظ
-------------------------------------------------------------------------------------
Error Line No	: ine 125
Error Message	: InvalidOperationException
Exception Type	: System.InvalidOperationException
Error Location	: The context cannot be used while the model is being created. This exception may be thrown if the context is used inside the OnModelCreating method or if the same context instance is accessed by multiple threads concurrently. Note that instance members of DbContext and related classes are not guaranteed to be thread safe.
Error Page Url	: http://localhost:33252/Login.aspx
------------------------------------*END*--------------------------------------------
		Exception Details on  14/06/1395 12:42:22 ق.ظ
-------------------------------------------------------------------------------------
Error 	: مجوز ورود شما تائید نشد - خطای ورود کاربر

------------------------------------*END*--------------------------------------------
		Exception Details on  14/06/1395 01:09:13 ق.ظ
-------------------------------------------------------------------------------------
Error Line No	: ine 125
Error Message	: SqlException
Exception Type	: System.Data.SqlClient.SqlException
Error Location	: Introducing FOREIGN KEY constraint 'FK_dbo.Letters_dbo.Offices_SenderOfficeID' on table 'Letters' may cause cycles or multiple cascade paths. Specify ON DELETE NO ACTION or ON UPDATE NO ACTION, or modify other FOREIGN KEY constraints.
Could not create constraint or index. See previous errors.
Error Page Url	: http://localhost:33252/Login.aspx
------------------------------------*END*--------------------------------------------
		Exception Details on  14/06/1395 01:09:13 ق.ظ
-------------------------------------------------------------------------------------
Error 	: مجوز ورود شما تائید نشد - خطای ورود کاربر

------------------------------------*END*--------------------------------------------
		Exception Details on  14/06/1395 02:56:37 ق.ظ
-------------------------------------------------------------------------------------
Error 	: مجوز ورود شما تائید نشد - خطای ورود کاربر

------------------------------------*END*--------------------------------------------
		Exception Details on  14/06/1395 02:56:37 ق.ظ
-------------------------------------------------------------------------------------
Error 	: مجوز ورود شما تائید نشد - خطای ورود کاربر

------------------------------------*END*--------------------------------------------
		Exception Details on  14/06/1395 02:58:41 ق.ظ
-------------------------------------------------------------------------------------
Error 	: مجوز ورود شما تائید نشد - خطای ورود کاربر

------------------------------------*END*--------------------------------------------
		Exception Details on  14/06/1395 02:58:41 ق.ظ
-------------------------------------------------------------------------------------
Error 	: مجوز ورود شما تائید نشد - خطای ورود کاربر

------------------------------------*END*--------------------------------------------
		Exception Details on  14/06/1395 02:59:27 ق.ظ
-------------------------------------------------------------------------------------
Error 	: مجوز ورود شما تائید نشد - خطای ورود کاربر

------------------------------------*END*--------------------------------------------
		Exception Details on  14/06/1395 02:59:27 ق.ظ
-------------------------------------------------------------------------------------
Error 	: مجوز ورود شما تائید نشد - خطای ورود کاربر

------------------------------------*END*--------------------------------------------
		Exception Details on  14/06/1395 03:00:02 ق.ظ
-------------------------------------------------------------------------------------
Error 	: مجوز ورود شما تائید نشد - خطای ورود کاربر

------------------------------------*END*--------------------------------------------
		Exception Details on  14/06/1395 03:00:02 ق.ظ
-------------------------------------------------------------------------------------
Error 	: مجوز ورود شما تائید نشد - خطای ورود کاربر

------------------------------------*END*--------------------------------------------
		Exception Details on  14/06/1395 10:40:38 ق.ظ
-------------------------------------------------------------------------------------
Error 	: مجوز ورود شما تائید نشد - خطای ورود کاربر

------------------------------------*END*--------------------------------------------
		Exception Details on  14/06/1395 10:40:38 ق.ظ
-------------------------------------------------------------------------------------
Error 	: مجوز ورود شما تائید نشد - خطای ورود کاربر

------------------------------------*END*--------------------------------------------
		Exception Details on  14/06/1395 10:48:56 ق.ظ
-------------------------------------------------------------------------------------
Error 	: مجوز ورود شما تائید نشد - خطای ورود کاربر

------------------------------------*END*--------------------------------------------
		Exception Details on  14/06/1395 10:48:56 ق.ظ
-------------------------------------------------------------------------------------
Error 	: مجوز ورود شما تائید نشد - خطای ورود کاربر

------------------------------------*END*--------------------------------------------
		Exception Details on  14/06/1395 12:27:56 ب.ظ
-------------------------------------------------------------------------------------
Error 	: مجوز ورود شما تائید نشد - خطای ورود کاربر

------------------------------------*END*--------------------------------------------
		Exception Details on  14/06/1395 12:27:56 ب.ظ
-------------------------------------------------------------------------------------
Error 	: مجوز ورود شما تائید نشد - خطای ورود کاربر

------------------------------------*END*--------------------------------------------
