		Exception Details on  26/02/1397 11:04:54 ب.ظ
-------------------------------------------------------------------------------------
Error 	: مجوز ورود شما تائید نشد - خطای ورود کاربر

------------------------------------*END*--------------------------------------------
		Exception Details on  26/02/1397 11:04:54 ب.ظ
-------------------------------------------------------------------------------------
Error 	: مجوز ورود شما تائید نشد - خطای ورود کاربر

------------------------------------*END*--------------------------------------------
