		Exception Details on  27/01/1396 07:36:06 ب.ظ
-------------------------------------------------------------------------------------
Error 	: ok

------------------------------------*END*--------------------------------------------
		Exception Details on  27/01/1396 07:36:09 ب.ظ
-------------------------------------------------------------------------------------
Error 	: ok

------------------------------------*END*--------------------------------------------
		Exception Details on  27/01/1396 07:36:14 ب.ظ
-------------------------------------------------------------------------------------
Error 	: ok

------------------------------------*END*--------------------------------------------
		Exception Details on  27/01/1396 07:36:14 ب.ظ
-------------------------------------------------------------------------------------
Error 	: ok

------------------------------------*END*--------------------------------------------
		Exception Details on  27/01/1396 07:36:18 ب.ظ
-------------------------------------------------------------------------------------
Error 	: ok

------------------------------------*END*--------------------------------------------
		Exception Details on  27/01/1396 07:36:18 ب.ظ
-------------------------------------------------------------------------------------
Error 	: ok

------------------------------------*END*--------------------------------------------
		Exception Details on  27/01/1396 07:36:20 ب.ظ
-------------------------------------------------------------------------------------
Error 	: ok

------------------------------------*END*--------------------------------------------
		Exception Details on  27/01/1396 07:36:20 ب.ظ
-------------------------------------------------------------------------------------
Error 	: ok

------------------------------------*END*--------------------------------------------
		Exception Details on  27/01/1396 07:36:22 ب.ظ
-------------------------------------------------------------------------------------
Error 	: ok

------------------------------------*END*--------------------------------------------
		Exception Details on  27/01/1396 07:36:32 ب.ظ
-------------------------------------------------------------------------------------
Error 	: ok

------------------------------------*END*--------------------------------------------
		Exception Details on  27/01/1396 10:16:55 ب.ظ
-------------------------------------------------------------------------------------
Error 	: مجوز ورود شما تائید نشد - خطای ورود کاربر

------------------------------------*END*--------------------------------------------
		Exception Details on  27/01/1396 10:16:55 ب.ظ
-------------------------------------------------------------------------------------
Error 	: مجوز ورود شما تائید نشد - خطای ورود کاربر

------------------------------------*END*--------------------------------------------
