[
{"car_id":1,"numSets":20,"dateSale":"2020-12-10","namecar":"Mazda","isSale":true,"PriceOfCar":38,"PriceOfSale":29,"nameOfBuyer":"Gardiner"},
{"car_id":2,"numSets":44,"dateSale":"2020-12-09","namecar":"Mitsubishi","isSale":true,"PriceOfCar":61,"PriceOfSale":4,"nameOfBuyer":"Rochell"},
{"car_id":3,"numSets":35,"dateSale":"2020-12-11","namecar":"Volkswagen","isSale":true,"PriceOfCar":62,"PriceOfSale":39,"nameOfBuyer":"Ardys"},
{"car_id":4,"numSets":80,"dateSale":"2019-12-12","namecar":"Aston Martin","isSale":true,"PriceOfCar":15,"PriceOfSale":20,"nameOfBuyer":"Lurline"},
{"car_id":5,"numSets":50,"dateSale":"2020-11-03","namecar":"Dodge","isSale":true,"PriceOfCar":22,"PriceOfSale":47,"nameOfBuyer":"Lurleen"}

]