POST https://westcentralus.api.cognitive.microsoft.com/text/analytics/v2.0/entities HTTP/1.1
Host: westcentralus.api.cognitive.microsoft.com
Content-Type: application/json
Ocp-Apim-Subscription-Key: ••••••••••••••••••••••••••••••••

{
  "documents": [
    {
      "language": "en",
      "id": "1",
      "text": "Microsoft released Windows 10"
    },
    {
      "language": "en",
      "id": "2",
      "text": "In 1975, Bill Gates III and Paul Allen founded the company."
    }
  ]
}


Key 1: 686fafabee6d4defb734da7b2e6b8660
Key 2: 6b45073dbf54499aae802caa6ba19381