<svg xmlns="http://www.w3.org/2000/svg" width="20" height="20" fill="none" viewBox="0 0 20 20">
    <path stroke="#595169" stroke-linecap="round" stroke-linejoin="round" stroke-width="2" d="M10 18.333c4.602 0 8.333-3.73 8.333-8.333 0-4.602-3.73-8.333-8.333-8.333-4.602 0-8.333 3.73-8.333 8.333 0 4.602 3.73 8.333 8.333 8.333zM1.667 10h16.666"/>
    <path stroke="#595169" stroke-linecap="round" stroke-linejoin="round" stroke-width="2" d="M10 1.667C12.085 3.949 13.27 6.91 13.333 10c-.064 3.09-1.248 6.051-3.333 8.333C7.916 16.051 6.731 13.09 6.667 10 6.73 6.91 7.916 3.949 10 1.667v0z"/>
</svg>
