<svg xmlns="http://www.w3.org/2000/svg" width="32" height="32" fill="none" viewBox="0 0 32 32">
    <circle cx="16" cy="16" r="16" fill="#B9D7E0"/>
    <path fill="#fff" stroke="#fff" stroke-width=".4" d="M22.667 14.663L16.588 8v3.991h-.706c-1.75 0-3.394.681-4.63 1.918-1.238 1.236-1.919 2.88-1.919 4.629v2.795l1.167-1.277c1.56-1.71 3.775-2.698 6.088-2.72v3.99l6.079-6.663zm-12.552 4.662v-.787c0-1.54.6-2.988 1.689-4.077 1.09-1.089 2.537-1.688 4.078-1.688h1.488v-2.757l4.239 4.647-4.24 4.647v-2.756h-.7c-2.468 0-4.84 1.006-6.554 2.77z"/>
</svg>
