<svg xmlns="http://www.w3.org/2000/svg" width="32" height="32" fill="none" viewBox="0 0 32 32">
    <circle cx="16" cy="16" r="16" fill="#DADBDD"/>
    <path fill-rule="evenodd" stroke="#fff" stroke-linecap="round" stroke-linejoin="round" stroke-width="1.29" d="M13 10.191l9 6-9 6v-12z" clip-rule="evenodd"/>
</svg>
