[{
    "name": "Dark Knight",
    "rating": "10"
}, {
    "name": "Truman Show",
    "rating": "10"
}, {
    "name": "Rangasthalam",
    "rating": 10
}, {
    "name": "Student",
    "rating": "2"
}, {
    "name": "Dangal",
    "rating": "7"
}]