{
  "projectType": "library",
  "root": "libs/shared",
  "sourceRoot": "libs/shared/src",
  "prefix": "monorepo-deployment-poc",
  "targets": {
    "test": {
      "executor": "@nrwl/jest:jest",
      "outputs": ["coverage/libs/shared"],
      "options": {
        "jestConfig": "libs/shared/jest.config.js",
        "passWithNoTests": true
      }
    },
    "lint": {
      "executor": "@nrwl/linter:eslint",
      "options": {
        "lintFilePatterns": [
          "libs/shared/src/**/*.ts",
          "libs/shared/src/**/*.html"
        ]
      }
    },
    "version": {
      "executor": "@jscutlery/semver:version",
      "options": {
        "commitMessageFormat": "chore(${projectName}): release version ${version}"
      }
    }
  },
  "tags": []
}
