<svg width="32" height="32" viewBox="0 0 32 32" fill="none" xmlns="http://www.w3.org/2000/svg">
<path d="M9.6069 9.54746V6.13411C9.6069 5.38745 10.1936 4.80078 10.9402 4.80078C11.6869 4.80078 12.2736 5.38745 12.2736 6.13411V9.54746C12.2736 10.2941 11.6869 10.8808 10.9402 10.8808C10.1936 10.8808 9.6069 10.2941 9.6069 9.54746ZM21.0736 10.8808C21.8202 10.8808 22.4069 10.2941 22.4069 9.54746V6.13411C22.4069 5.38745 21.8202 4.80078 21.0736 4.80078C20.3269 4.80078 19.7402 5.38745 19.7402 6.13411V9.54746C19.7402 10.2941 20.3269 10.8808 21.0736 10.8808ZM28.2736 7.84075V25.8674C28.2736 26.4541 27.7936 26.9341 27.2069 26.9341H4.8069C4.22023 26.9341 3.74023 26.4541 3.74023 25.8674V7.84075C3.74023 7.25409 4.22023 6.66745 4.8069 6.66745H7.28691C7.87358 6.66745 8.35358 7.14745 8.35358 7.73411C8.35358 8.32078 7.87358 8.80078 7.28691 8.80078H5.84691V13.3341H26.1136V8.80078H24.7002C24.1136 8.80078 23.6336 8.32078 23.6336 7.73411C23.6336 7.14745 24.1136 6.66745 24.7002 6.66745H27.1802C27.7936 6.66745 28.2736 7.25409 28.2736 7.84075ZM26.1402 24.8008V15.2008H5.87357V24.8008H26.1402ZM14.3269 8.80078H17.6869C18.2736 8.80078 18.7536 8.32078 18.7536 7.73411C18.7536 7.14745 18.2736 6.66745 17.6869 6.66745H14.3269C13.7402 6.66745 13.2602 7.14745 13.2602 7.73411C13.2602 8.32078 13.7402 8.80078 14.3269 8.80078Z" fill="#395B65"/>
</svg>
