<svg xmlns="http://www.w3.org/2000/svg" viewbox="0 0 112 29.175">
<path d="M15.875 10.665c.7.725 1.2 2.099 1.2 3.174 0 2.274-1.375 4.074-3.125 4.974-.925.575-2.474.775-2.924.775-.5 0-.9-.025-1.149-.05-.1 0-.2.075-.2.25-.025 1.675 0 3.424.05 4.099.075.925.3 1.375 1.5 1.475.425.05.575.175.575.325s-.25.225-.6.225c-.649 0-1.875-.1-2.624-.1-.675 0-1.425.075-1.95.075-.4 0-.525-.125-.525-.25 0-.15.175-.25.525-.325.775-.15 1-.425 1.025-1.449.025-.55.075-2 .075-5.974 0-2.725-.025-4.149-.075-5.949-.025-.325-.05-.675-.6-1.1-.2-.15-.325-.25-.325-.35 0-.125.2-.25.375-.325.8-.3 1.799-.875 2.125-1.075.15-.1.325-.15.4-.15.05 0 .1.175.1.25 0 .225-.075 1.075-.075 1.299 0 .05.05.15.15.1.55-.425 1.5-.85 2.049-1.05.425-.175.8-.2 1.275-.2 1.173.001 2.073.626 2.748 1.326zm-5.899.3c-.125.1-.25.4-.275.7 0 1.25 0 4.674.15 5.399.025.225.175.625.3.774.55.55 1.375.975 2.174.975.375 0 .7-.15 1.05-.35.775-.375 1.549-2.324 1.549-3.824 0-1.35-.325-2.349-.95-3.049-.475-.525-1.299-1.05-2.449-1.05-.799 0-1.349.25-1.549.425zm15.774 6.648c.15-.175.25-.675.25-1.15 0-1.1.025-4.199 0-5.249 0-.4-.1-.75-.4-.85-.325-.125-.5-.15-.725-.2-.325-.075-.45-.2-.45-.35s.25-.175.45-.175c.475 0 2.049-.05 2.399-.1.175-.025.475-.075.6-.075s.2.25.2.8c0 1.075-.075 2.449-.075 6.898 0 1.175.1 1.425.5 1.425.35-.025 1.2-.2 1.325-.2.1 0 .175.1.175.175 0 .1-.075.45-.225.475-.875.125-2.375.5-2.924.65-.275.1-.525.125-.6.125-.1 0-.225-.225-.225-.45 0-.45.025-1.05.05-1.325 0-.05-.1-.05-.125-.025-.225.175-1.149.975-1.85 1.325-.675.325-1.125.375-1.649.375-.825 0-1.55-.3-2.024-.825-.4-.425-.65-1.125-.65-2 0-2.049.05-4.774-.025-5.624-.05-.65-.025-.8-.8-1.075-.2-.075-.475-.2-.475-.35 0-.15.2-.2.55-.2 1.35 0 2.2-.15 2.774-.15.05 0 .15.15.125.35-.05 1.6-.125 4.449-.125 6.099 0 1.125.2 1.725.7 2.05.375.275.925.399 1.5.375 1.049.001 1.424-.399 1.749-.749zm13.7-7.248c1.025.85 1.75 2.175 1.75 3.799 0 1.949-.95 3.624-2.574 4.574-1.15.7-2.399.925-3.349.925-1.15 0-2.175-.275-2.799-.575-.175-.075-.3-.05-.4.05-.1.15-.275.275-.375.275-.15 0-.225-.225-.225-.675 0-2.625.075-5.949.075-8.898 0-3.049-.075-4.874-.15-5.898 0-.275-.075-.425-.65-.85-.25-.175-.325-.25-.325-.325 0-.2.325-.3.55-.375.675-.15 1.424-.325 1.924-.524.275-.125.425-.15.525-.15.125 0 .15.25.15.575 0 .725-.1 4.374-.1 7.798 0 .075.1.175.15.15.65-.4 1.85-.925 2.875-.925.948-.001 2.198.399 2.948 1.049zm-5.599.275c-.225.15-.25.225-.3.55-.125.75-.075 2.075-.075 2.825 0 1.424.1 2.449.275 3.124.325 1.125 1.375 1.875 2.325 1.875.45 0 1.125-.225 1.524-.575.725-.65 1.375-2.049 1.375-3.649 0-2.3-1.175-4.449-3.724-4.449-.6-.001-1.175.149-1.4.299zm9.95-6.473c-.05-.5-.1-.675-.825-1.125-.15-.15-.25-.225-.25-.3 0-.1.125-.225.25-.275.625-.325 2.5-.9 2.825-.9.05 0 .15.175.15.4-.05 2.375-.1 5.324-.1 7.948 0 2.899.025 5.749.1 7.423.05 1.225.1 1.325 1.075 1.6.375.125.425.225.425.325 0 .15-.25.225-.525.225-.525 0-1.35-.1-2.299-.1-.9 0-1.5.075-2 .075-.3 0-.525-.125-.525-.275 0-.1.075-.2.375-.275 1.075-.25 1.25-.475 1.324-1.5.05-.525.125-4.224.125-7.148 0-2.224 0-4.799-.125-6.098zm5.875 6.048c.9-.325 2.175-.95 2.399-.975.1 0 .2.175.2.3-.05.475-.075 2.899-.075 4.624 0 2.299 0 3.074.05 3.774.025.6.3.75 1.1.95.375.075.475.2.475.3 0 .175-.175.275-.55.275-.649 0-1.399-.075-2.174-.075-.925 0-1.325.125-1.95.125-.375 0-.5-.125-.5-.25s.15-.225.5-.3c.625-.15.975-.375 1.05-.95.05-.5.075-1.775.075-3.724 0-1.25-.075-2.1-.1-2.45-.05-.425-.25-.575-.8-1.024-.1-.1-.15-.1-.15-.25 0-.1.175-.25.45-.35zm2.799-4.324c0 .725-.524 1.149-1.1 1.149a1.11 1.11 0 01-1.1-1.1c0-.575.575-1.175 1.125-1.175.65.001 1.075.526 1.075 1.126zm10.674 3.974c.15.075.3.35.3.575 0 .325-.3 1.075-.575 1.075-.175 0-.5-.25-.725-.475-.65-.55-1.4-1.149-2.425-1.149-.825 0-1.625.675-2.049 1.25-.4.5-.725 1.5-.725 2.75 0 1.85 1.324 4.424 3.949 4.424 1.525 0 2.225-.65 2.699-1.15.1-.1.2.025.2.1 0 .275-.275.65-.425.825-.8.975-2.125 1.65-3.724 1.65-1.625 0-2.674-.65-3.474-1.55-.85-.9-1.25-2.299-1.25-3.349 0-2.2.95-3.574 2.325-4.499.7-.475 2.125-1.075 3.374-1.075 1.126-.002 2.175.298 2.525.598zm8.275.325c.65.775.675 1.75.675 2.699v.3c0 .825-.1 2.249-.075 3.649 0 1.2.525 1.5 1 1.5.25 0 .65-.125.9-.275.05-.025.2.025.2.175 0 .05 0 .175-.075.3-.375.725-1.1 1.2-2.175 1.2-.85 0-1.425-.475-1.7-1.25-.025-.05-.15-.1-.175-.05-1.25.875-2.125 1.3-2.924 1.3-.925 0-1.975-.725-1.975-2.274 0-1.175.9-1.525 1.3-1.7l3.449-1.125c.175-.1.325-.225.35-.475.025-.3.05-1.575.025-2.125 0-.45-.45-1.75-1.774-1.75-.575 0-1.3.075-1.3 1.524 0 .05-.125.225-.25.275-.1.075-1.35.75-1.475.75-.15 0-.3-.175-.3-.25 0-1.025 1.5-2.1 2.524-2.674.55-.325 1.274-.65 1.799-.65.701.001 1.451.351 1.976.926zm-1.6 7.848c.3-.35.325-1.975.325-2.774 0-.1-.075-.175-.125-.175-1.625.4-2.924.875-2.924 1.949 0 .875.575 1.475 1.425 1.475.499 0 .949-.1 1.299-.475zm11.15-8.323c.1 0 .225.5.225.975 0 .1-.15.325-.3.325-.375 0-2.524-.1-3.174-.1-.05 0-.1.125-.1.2l.025 5.049c0 .9.2 1.549.55 1.875.275.275.975.45 1.325.45.425 0 .825-.125 1.2-.325.125-.05.225-.125.275-.125.05 0 .125.1.125.175 0 .35-.45.7-.7.9-.45.35-1.324.625-2.099.625-.975 0-1.725-.4-2.075-.8-.575-.575-.7-1.35-.675-2.399.05-1.925.125-3.974.125-5.249 0-.175-.075-.3-.175-.35a6.2 6.2 0 00-.675-.2c-.075 0-.275-.15-.275-.225 0-.175.275-.375.5-.524.725-.45 1.475-1.125 1.975-1.6.125-.15.3-.275.425-.275.1 0 .175.2.175.35V9.54c0 .05.05.2.125.2.148 0 3.198-.025 3.198-.025zm2.126.5c.9-.325 2.175-.95 2.399-.975.1 0 .2.175.2.3-.05.475-.075 2.899-.075 4.624 0 2.299 0 3.074.05 3.774.025.6.3.75 1.1.95.375.075.475.2.475.3 0 .175-.175.275-.55.275-.649 0-1.399-.075-2.174-.075-.925 0-1.325.125-1.95.125-.375 0-.5-.125-.5-.25s.15-.225.5-.3c.625-.15.975-.375 1.05-.95.05-.5.075-1.775.075-3.724 0-1.25-.075-2.1-.1-2.45-.05-.425-.25-.575-.8-1.024-.1-.1-.15-.1-.15-.25 0-.1.175-.25.45-.35zm2.799-4.324c0 .725-.524 1.149-1.1 1.149a1.11 1.11 0 01-1.1-1.1c0-.575.575-1.175 1.125-1.175.65.001 1.075.526 1.075 1.126zm12.798 8.473c0 2.399-1.275 3.699-2.299 4.424-.875.625-1.925.95-2.699.95-3.049 0-5.349-2.225-5.349-5.174 0-1.45.575-2.799 1.55-3.749.9-.875 2.299-1.55 3.599-1.55 2.749 0 5.198 2.049 5.198 5.099zm-7.223-3.399c-.45.625-.875 1.75-.875 3.324 0 2.499 1.2 4.849 3.199 4.849.3 0 1.1-.2 1.625-.95.575-.75 1-2 1-3.574 0-1.825-1.1-4.749-3.125-4.749-.624 0-1.224.25-1.824 1.1z"/>
</svg>
