<?xml version="1.0" standalone="no"?>
<!DOCTYPE svg PUBLIC "-//W3C//DTD SVG 20010904//EN"
 "http://www.w3.org/TR/2001/REC-SVG-20010904/DTD/svg10.dtd">
<svg version="1.0" xmlns="http://www.w3.org/2000/svg"
 width="700.000000pt" height="700.000000pt" viewBox="0 0 700.000000 700.000000"
 preserveAspectRatio="xMidYMid meet">
<metadata>
Created by potrace 1.11, written by Peter Selinger 2001-2013
</metadata>
<g transform="translate(0.000000,700.000000) scale(0.100000,-0.100000)"
fill="#000000" stroke="none">
<path d="M3178 6995 c-2 -1 -56 -5 -120 -9 -133 -7 -195 -12 -318 -27 -156
-18 -175 -20 -205 -25 -16 -3 -46 -7 -65 -10 -19 -2 -82 -13 -140 -25 -58 -11
-116 -23 -130 -25 -14 -3 -33 -7 -42 -10 -10 -3 -30 -7 -45 -10 -98 -18 -358
-99 -495 -156 -85 -34 -124 -53 -233 -112 -11 -6 -42 -27 -70 -46 -219 -152
-329 -325 -327 -514 1 -45 3 -88 5 -96 2 -8 7 -28 12 -45 11 -43 62 -144 93
-185 102 -135 310 -274 552 -368 129 -50 289 -102 313 -102 31 0 18 -19 -40
-56 -32 -20 -91 -57 -131 -83 -351 -223 -631 -418 -632 -440 0 -21 45 -58 180
-146 110 -72 524 -329 605 -375 26 -15 826 -495 865 -519 16 -10 391 -230 425
-249 152 -87 223 -126 242 -133 27 -10 143 48 443 221 107 62 204 118 215 124
11 6 31 18 45 27 14 9 111 66 215 129 105 62 206 123 225 135 19 12 112 68
205 125 214 129 582 359 700 436 50 32 97 62 105 66 29 13 204 144 207 155 3
7 -22 32 -54 58 -66 52 -397 275 -615 414 -82 52 -148 97 -148 100 0 3 39 17
88 30 370 101 688 290 814 483 70 107 91 179 90 303 -3 309 -319 583 -860 746
-53 16 -110 33 -127 39 -16 5 -89 22 -160 39 -111 25 -183 39 -335 65 -52 9
-178 25 -240 31 -36 4 -72 8 -80 10 -8 2 -58 7 -110 10 -52 4 -111 9 -130 11
-41 5 -787 14 -792 9z m572 -480 c102 -3 203 -8 225 -10 22 -2 78 -7 124 -10
47 -4 92 -8 100 -10 9 -2 45 -6 81 -10 173 -18 499 -82 669 -131 269 -78 509
-201 571 -292 l23 -33 -30 -36 c-102 -126 -446 -271 -828 -349 -26 -5 -64 -13
-95 -19 -14 -3 -34 -7 -45 -9 -12 -2 -46 -7 -77 -11 l-56 -7 -144 84 c-500
294 -604 338 -786 333 -136 -3 -277 -60 -563 -225 -68 -40 -171 -99 -228 -132
-111 -65 -104 -63 -226 -43 -414 71 -760 195 -933 333 -61 48 -76 73 -61 103
29 62 229 183 403 245 201 72 490 141 706 169 25 3 56 8 70 11 14 2 45 7 70 9
25 3 60 7 78 9 18 3 65 7 105 11 39 3 95 8 122 10 28 3 131 7 230 11 99 3 181
7 182 8 2 2 115 -1 313 -9z"/>
<path d="M885 4175 c-3 -8 -7 -23 -10 -32 -15 -47 -20 -318 -20 -1138 0 -1083
8 -1389 41 -1488 56 -175 163 -285 479 -493 66 -43 122 -82 123 -86 2 -5 8 -8
12 -8 5 0 47 -24 92 -53 115 -74 630 -389 883 -539 498 -297 654 -365 734
-323 33 17 47 50 57 140 7 59 12 2105 6 2477 l-3 187 -212 127 c-117 70 -225
135 -242 144 -16 10 -84 50 -150 90 -66 40 -136 82 -155 93 -19 11 -138 81
-265 157 -472 282 -895 528 -1060 616 -277 148 -301 158 -310 129z"/>
<path d="M6024 4161 c-116 -55 -618 -339 -1009 -571 -77 -46 -183 -108 -235
-139 -52 -30 -97 -58 -100 -61 -3 -3 -14 -10 -25 -16 -11 -6 -226 -133 -477
-283 l-457 -273 -3 -167 c-6 -330 -1 -2428 6 -2500 12 -126 51 -163 151 -143
59 12 213 82 335 152 41 23 95 54 120 68 136 76 859 516 1110 675 475 300 600
416 664 612 33 102 41 395 41 1485 0 923 -6 1141 -31 1182 -9 13 -26 9 -90
-21z"/>
</g>
</svg>
