<svg width="34" height="34" viewBox="0 0 34 34" fill="none" xmlns="http://www.w3.org/2000/svg">
<path d="M33.3591 25.6521L27.9206 20.2111C27.0923 19.3817 25.6482 19.3817 24.8206 20.2111L21.2505 23.7833C20.9798 24.0541 20.566 24.1254 20.2417 23.9592C15.776 21.6508 12.3419 18.2147 10.0349 13.7464C9.86816 13.4226 9.93941 13.0079 10.2101 12.7377L13.7808 9.16492C14.6359 8.30932 14.6359 6.918 13.7808 6.06306L8.34232 0.622071C7.51403 -0.207357 6.06991 -0.207357 5.24228 0.622071L2.01148 3.85409C-0.217129 6.084 -0.642061 9.50114 0.978566 12.1628C6.21701 20.7632 13.2304 27.7813 21.8245 33.0201C22.9044 33.6795 24.1086 34 25.3076 34C27.0616 34 28.8045 33.3119 30.1283 31.9873L33.3578 28.7565C33.3578 28.7565 33.3591 28.7559 33.3597 28.7552C34.2135 27.899 34.2135 26.5077 33.3591 25.6521L33.3591 25.6521ZM26.9956 21.136L32.434 26.577C32.7792 26.9217 32.7792 27.4843 32.434 27.829C32.0895 28.1731 31.528 28.1731 31.1828 27.829L25.7443 22.3874C25.3998 22.0426 25.3998 21.4807 25.7443 21.136C26.079 20.8011 26.6621 20.8011 26.9956 21.136H26.9956ZM7.41727 1.54634L12.8558 6.98734C13.2009 7.33206 13.2009 7.89461 12.8558 8.23933C12.5112 8.58275 11.9497 8.58405 11.6045 8.23933L6.16601 2.79768C5.82149 2.45296 5.82149 1.89107 6.16601 1.54635C6.50007 1.21144 7.08321 1.21144 7.41727 1.54635L7.41727 1.54634ZM29.2032 31.0617C27.4028 32.8651 24.648 33.2092 22.5043 31.9029C14.09 26.7726 7.22311 19.9017 2.0945 11.4812C0.788323 9.33695 1.13415 6.58047 2.93521 4.77837L4.75066 2.96252C4.85722 3.23921 5.01869 3.49956 5.24162 3.72261L10.6801 9.16426C10.903 9.38732 11.1632 9.54888 11.4398 9.65551L9.28567 11.8115C8.60643 12.4905 8.44103 13.5089 8.87316 14.3462C11.307 19.0605 14.9301 22.6856 19.6423 25.1216C19.9528 25.2818 20.2875 25.3597 20.6216 25.3597C21.1871 25.3597 21.748 25.1353 22.1749 24.7088L24.3302 22.5522C24.4368 22.8289 24.5983 23.0892 24.8212 23.3123L30.2597 28.7539C30.4826 28.977 30.7428 29.1386 31.0193 29.2452L29.2032 31.0617Z" fill="white"/>
</svg>
