{
  "services": [
    {
      "id": 1,
      "category": "companies",
      "title": "Ежедневная уборка",
      "text": "Квартир, зданий, производственных помещений и офиcов",
      "imgSrc": "icon-1.svg",
      "alt": "icon-dayly-clean"
    },
    {
      "id": 2,
      "category": "companies",
      "title": "Промышленный клининг",
      "text": "Квартир, зданий, производственных помещений и офиcов",
      "imgSrc": "icon-1.svg",
      "alt": "icon-dayly-clean"
    },
    {
      "id": 3,
      "category": "companies",
      "title": "Мойка окон и фасадов",
      "text": "Квартир, зданий, производственных помещений и офиcов",
      "imgSrc": "icon-1.svg",
      "alt": "icon-dayly-clean"
    },
    {
      "id": 4,
      "category": "companies",
      "title": "Уборка офисов под ключ",
      "text": "Квартир, зданий, производственных помещений и офиcов",
      "imgSrc": "icon-1.svg",
      "alt": "icon-dayly-clean"
    },
    {
      "id": 5,
      "category": "companies",
      "title": "Послестроительная уборка",
      "text": "Квартир, зданий, производственных помещений и офиcов",
      "imgSrc": "icon-1.svg",
      "alt": "icon-dayly-clean"
    },
    {
      "id": 6,
      "category": "companies",
      "title": "Клининг для ТСЖ, ЖСК, УК",
      "text": "Квартир, зданий, производственных помещений и офиcов",
      "imgSrc": "icon-1.svg",
      "alt": "icon-dayly-clean"
    },
    {
      "id": 7,
      "category": "companies",
      "title": "Обслуживание мероприятий",
      "text": "Квартир, зданий, производственных помещений и офиcов",
      "imgSrc": "icon-1.svg",
      "alt": "icon-dayly-clean"
    },
    {
      "id": 8,
      "category": "companies",
      "title": "Предоставление персонала",
      "text": "Квартир, зданий, производственных помещений и офиcов",
      "imgSrc": "icon-1.svg",
      "alt": "icon-dayly-clean"
    },
    {
      "id": 9,
      "category": "private",
      "title": "Ежедневная уборка",
      "text": "Квартир, зданий, производственных помещений и офиcов",
      "imgSrc": "icon-1.svg",
      "alt": "icon-dayly-clean"
    },
    {
      "id": 10,
      "category": "private",
      "title": "Промышленный клининг",
      "text": "Квартир, зданий, производственных помещений и офиcов",
      "imgSrc": "icon-1.svg",
      "alt": "icon-dayly-clean"
    },
    {
      "id": 11,
      "category": "private",
      "title": "Мойка окон и фасадов",
      "text": "Квартир, зданий, производственных помещений и офиcов",
      "imgSrc": "icon-1.svg",
      "alt": "icon-dayly-clean"
    },
    {
      "id": 12,
      "category": "private",
      "title": "Уборка офисов под ключ",
      "text": "Квартир, зданий, производственных помещений и офиcов",
      "imgSrc": "icon-1.svg",
      "alt": "icon-dayly-clean"
    },
    {
      "id": 13,
      "category": "private",
      "title": "Послестроительная уборка",
      "text": "Квартир, зданий, производственных помещений и офиcов",
      "imgSrc": "icon-1.svg",
      "alt": "icon-dayly-clean"
    },
    {
      "id": 14,
      "category": "private",
      "title": "Клининг для ТСЖ, ЖСК, УК",
      "text": "Квартир, зданий, производственных помещений и офиcов",
      "imgSrc": "icon-1.svg",
      "alt": "icon-dayly-clean"
    },
    {
      "id": 15,
      "category": "individual",
      "title": "Предоставление персонала",
      "text": "Квартир, зданий, производственных помещений и офиcов",
      "imgSrc": "icon-1.svg",
      "alt": "icon-dayly-clean"
    },
    {
      "id": 16,
      "category": "individual",
      "title": "Ежедневная уборка",
      "text": "Квартир, зданий, производственных помещений и офиcов",
      "imgSrc": "icon-1.svg",
      "alt": "icon-dayly-clean"
    },
    {
      "id": 17,
      "category": "individual",
      "title": "Промышленный клининг",
      "text": "Квартир, зданий, производственных помещений и офиcов",
      "imgSrc": "icon-1.svg",
      "alt": "icon-dayly-clean"
    },
    {
      "id": 18,
      "category": "individual",
      "title": "Мойка окон и фасадов",
      "text": "Квартир, зданий, производственных помещений и офиcов",
      "imgSrc": "icon-1.svg",
      "alt": "icon-dayly-clean"
    },
    {
      "id": 19,
      "category": "individual",
      "title": "Уборка офисов под ключ",
      "text": "Квартир, зданий, производственных помещений и офиcов",
      "imgSrc": "icon-1.svg",
      "alt": "icon-dayly-clean"
    },
    {
      "id": 20,
      "category": "individual",
      "title": "Послестроительная уборка",
      "text": "Квартир, зданий, производственных помещений и офиcов",
      "imgSrc": "icon-1.svg",
      "alt": "icon-dayly-clean"
    },
    {
      "id": 21,
      "category": "individual",
      "title": "Клининг для ТСЖ, ЖСК, УК",
      "text": "Квартир, зданий, производственных помещений и офиcов",
      "imgSrc": "icon-1.svg",
      "alt": "icon-dayly-clean"
    }
  ],
  "trust-companies": [
    {
      "id": 1,
      "imgSrc": "gazprom.png",
      "alt": "gazprom",
      "link": "#"
    },
    {
      "id": 2,
      "imgSrc": "aiptek.png",
      "alt": "aiptek",
      "link": "#"
    },
    {
      "id": 3,
      "imgSrc": "ncr.png",
      "alt": "ncr",
      "link": "#"
    },
    {
      "id": 4,
      "imgSrc": "park-inn.png",
      "alt": "park-inn",
      "link": "#"
    },
    {
      "id": 5,
      "imgSrc": "techno-sila.png",
      "alt": "techno-sila",
      "link": "#"
    },
    {
      "id": 6,
      "imgSrc": "a5.png",
      "alt": "a5",
      "link": "#"
    }
  ],
  "slider": [
    {
      "id": 1,
      "title": "Уборка помещения после ремонта",
      "processText": "Влажная очистка поверхностей, с использованием хим. моющих средств, от следов краски, цемента, затирок, клея, извёстки",
      "resultText": "пециалисты выполнили гениральную уборку помещения качественно и в короткие сроки",
      "imgSrc1": "result-1-1.png",
      "imgSrc2": "result-1-2.png"
    },
    {
      "id": 2,
      "title": "Мойка окон в БЦ название",
      "processText": "Влажная очистка поверхностей, с использованием хим. моющих средств, от следов краски, цемента, затирок, клея, извёстки",
      "resultText": "пециалисты выполнили гениральную уборку помещения качественно и в короткие сроки",
      "imgSrc1": "result-1-1.png",
      "imgSrc2": "result-1-1.png"
    },
    {
      "id": 3,
      "title": "Уборка помещения после ремонта",
      "processText": "Влажная очистка поверхностей, с использованием хим. моющих средств, от следов краски, цемента, затирок, клея, извёстки",
      "resultText": "пециалисты выполнили гениральную уборку помещения качественно и в короткие сроки",
      "imgSrc1": "result-1-2.png",
      "imgSrc2": "result-1-2.png"
    },
    {
      "id": 4,
      "title": "Мойка окон в БЦ название",
      "processText": "Влажная очистка поверхностей, с использованием хим. моющих средств, от следов краски, цемента, затирок, клея, извёстки",
      "resultText": "пециалисты выполнили гениральную уборку помещения качественно и в короткие сроки",
      "imgSrc1": "result-1-1.png",
      "imgSrc2": "result-1-2.png"
    },
    {
      "id": 5,
      "title": "Уборка помещения после ремонта",
      "processText": "Влажная очистка поверхностей, с использованием хим. моющих средств, от следов краски, цемента, затирок, клея, извёстки",
      "resultText": "пециалисты выполнили гениральную уборку помещения качественно и в короткие сроки",
      "imgSrc1": "result-1-1.png",
      "imgSrc2": "result-1-2.png"
    }
  ]
}