<svg width="33" height="38" viewBox="0 0 33 38" fill="none" xmlns="http://www.w3.org/2000/svg">
<path d="M32.1539 15.4528C32.1539 14.3611 31.4231 13.3058 30.1603 12.5268C30.8757 11.4066 31.0694 10.2812 30.685 9.35385C30.2663 8.34465 29.1862 7.64896 27.7217 7.41292C27.9534 6.10558 27.7013 4.99188 26.9902 4.28158C26.3143 3.60708 25.251 3.344 24.008 3.52889C23.682 2.40862 23.0507 1.596 22.2183 1.25181C21.25 0.847693 20.0377 1.08885 18.8685 1.88319C18.3043 1.10785 17.2725 0 15.9885 0C14.8339 0 13.7823 1.08008 13.1721 1.862C12.2323 1.17654 10.8958 0.811155 9.83616 1.25108C8.89054 1.64204 8.25624 2.61689 8.00777 4.03458C6.63831 3.75542 5.4435 4.00023 4.70908 4.73319C4.06381 5.37773 3.79635 6.35039 3.93081 7.51962C2.71335 7.82654 1.8335 8.47473 1.46885 9.35458C1.08446 10.2827 1.27738 11.4073 1.99427 12.5276C0.730769 13.3051 0 14.3596 0 15.4528C0 16.4562 0.60946 17.4215 1.7005 18.1823C0.832346 19.3844 0.561231 20.6384 0.979231 21.6483C1.36435 22.5757 2.29754 23.2341 3.59612 23.5205C3.25412 24.9638 3.48358 26.2258 4.25673 26.9975C5.03938 27.7795 5.84615 27.9183 7.30769 27.7385V35.0565C7.30769 36.6788 8.62819 38 10.252 38C10.8695 38 11.4621 37.81 11.9634 37.4512L15.2161 35.1288C15.7313 34.7605 16.4233 34.7605 16.9385 35.1288L20.1904 37.4512C20.6925 37.81 21.2844 38 21.9019 38C23.5257 38 24.8462 36.6788 24.8462 35.0557V28.2406C25.5769 28.321 26.8397 28.0535 27.444 27.4499C28.4123 26.4831 28.3926 24.9419 28.0082 23.6192C29.3418 23.4431 30.6718 22.8636 31.1746 21.6483C31.5926 20.6391 31.3222 19.3851 30.4541 18.183C31.5444 17.4215 32.1538 16.4569 32.1538 15.4528H32.1539ZM21.9019 36.5385C21.5906 36.5385 21.2932 36.4427 21.0403 36.2622L17.7891 33.9398C16.7653 33.2083 15.3907 33.2069 14.3662 33.9398L11.1143 36.2622C10.8607 36.4427 10.5633 36.5385 10.2527 36.5385C9.43497 36.5385 8.76924 35.8735 8.76924 35.0557V29.9944C8.76924 30.4022 9.44447 30.7325 9.92459 30.9313C10.8855 31.3273 12.0847 31.095 13.2467 30.3101C14.0184 31.4786 15.0378 32.1538 16.0769 32.1538C17.1168 32.1538 18.1355 31.4786 18.9079 30.3108C20.0691 31.095 21.2683 31.3281 22.2293 30.932C22.6816 30.7449 23.3846 30.4161 23.3846 29.982V35.0565C23.3846 35.8735 22.7196 36.5385 21.9019 36.5385L21.9019 36.5385ZM28.8179 18.4928C29.6817 19.4158 30.0858 20.4586 29.8249 21.0885C29.5413 21.774 28.3772 22.2439 26.9924 22.2176L25.8312 22.2L26.3172 23.2545C26.828 24.3631 27.0246 25.8042 26.4122 26.4158C25.9474 26.8806 24.9068 26.9267 23.758 26.5269L22.8468 26.2112L22.7898 27.1737C22.7174 28.3845 22.279 29.3287 21.671 29.5808C21.0615 29.8337 20.083 29.4741 19.1761 28.6688L18.4549 28.0287L18.0339 28.8968C17.5034 29.9871 16.7354 30.6923 16.0769 30.6923C15.4192 30.6923 14.6512 29.9871 14.1214 28.8968L13.7005 28.0287L12.9792 28.6688C12.073 29.4748 11.0945 29.8329 10.4844 29.5808C9.68343 29.249 9.3122 27.8416 9.36043 26.6227L9.40647 25.4622L8.34101 25.9233C7.07093 26.4736 5.81693 26.4875 5.29078 25.9635C4.80116 25.4739 4.77632 24.3814 5.2272 23.18L5.56628 22.276L4.60385 22.1957C3.44485 22.0985 2.57378 21.6739 2.33043 21.0878C2.07028 20.4586 2.47439 19.4151 3.33816 18.4921L3.99805 17.7855L3.13866 17.3433C2.10389 16.8106 1.46155 16.0864 1.46155 15.4528C1.46155 14.7608 2.21716 13.9701 3.38712 13.4388L4.2677 13.0391L3.64362 12.301C2.89239 11.4139 2.5767 10.499 2.81932 9.91288C3.04586 9.36699 3.8117 8.96069 4.86986 8.82842L5.68174 8.72611L5.48809 7.9303C5.25424 6.96861 5.34924 6.15892 5.74312 5.76576C6.20716 5.30246 7.24924 5.25569 8.39728 5.65469L9.30855 5.97038L9.36555 5.00796C9.44155 3.71742 9.81789 2.84049 10.3959 2.60153C11.028 2.33772 12.1783 2.74403 12.7154 3.42073L13.3585 4.22896L13.9073 3.35349C14.3859 2.59057 15.3776 1.46153 15.9885 1.46153C16.7763 1.46153 17.7153 2.70092 18.0471 3.30161L18.4877 4.09888L19.171 3.49818C20.075 2.70311 21.0549 2.34868 21.6593 2.60153C22.1781 2.81638 22.5786 3.52815 22.7299 4.50445L22.8555 5.31341L23.6455 5.09637C24.673 4.81503 25.5389 4.89614 25.9577 5.31487C26.4064 5.7643 26.4663 6.73038 26.1133 7.83603L25.8188 8.7568L26.7849 8.78895C28.0484 8.83206 29.0744 9.28368 29.3353 9.9136C29.5779 10.4997 29.2622 11.4146 28.5117 12.3025L27.8876 13.0398L28.7675 13.4396C29.9367 13.9716 30.6923 14.7615 30.6923 15.4536C30.6923 16.0871 30.05 16.8121 29.0167 17.3448L28.1573 17.7869L28.8179 18.4928Z" fill="white"/>
<path d="M12.6924 19.8204C12.6924 20.1317 12.365 20.3845 11.9616 20.3845H10.5001C10.0967 20.3845 9.76929 20.1317 9.76929 19.8204V14.1793C9.76929 13.868 10.0967 13.6152 10.5001 13.6152H11.9616C12.365 13.6152 12.6924 13.868 12.6924 14.1793V19.8204Z" fill="#F25929"/>
<path d="M18.8572 12.8155C18.5327 12.8155 18.2693 12.5329 18.2693 12.1847V9.66161C18.2693 8.62147 17.4874 7.7775 16.5197 7.7693C16.1905 7.76678 15.9177 8.04684 15.9177 8.40007V11.2751C15.9177 11.8182 15.5937 12.3001 15.1134 12.4723L14.5555 12.6716C14.3156 12.7574 14.1539 12.9984 14.1539 13.2696V19.7539C14.1539 20.1021 14.4173 20.3847 14.7418 20.3847H18.8572C20.8056 20.3847 22.3847 18.6898 22.3847 16.6001V14.077C22.3847 13.38 21.8585 12.8155 21.2089 12.8155H18.8572Z" fill="#F25929"/>
</svg>
