Division,WeightClassKg,Place,Name,Team,BodyweightKg,Best3SquatKg,Best3BenchKg,Best3DeadliftKg,TotalKg,Equipment,Event,Sex,BirthDate
Girls,44.23,1,Delilah Garcia,Brady,44.13,104.33,52.16,124.74,281.23,Unlimited,SBD,F,
Girls,44.23,2,Angelica Estrada,San Angelo Lake View,42.64,95.25,61.23,90.72,247.21,Unlimited,SBD,F,
Girls,47.85,1,Meghan Mccorkle,Early,47.54,92.99,54.43,108.86,256.28,Unlimited,SBD,F,
Girls,47.85,2,Henslee Middleton,Early,46.54,97.52,52.16,95.25,244.94,Unlimited,SBD,F,
Girls,47.85,3,Lillian Ramos,Brady,47.17,77.11,45.36,102.06,224.53,Unlimited,SBD,F,
Girls,47.85,4,Gabrielle Lewellen,Lampasas,47.26,70.31,34.02,86.18,190.51,Unlimited,SBD,F,
Girls,47.85,5,Kylianne Womack,San Angelo Grape Creek,47.81,45.36,22.68,65.77,133.81,Unlimited,SBD,F,
Girls,51.94,1,Julienne Socong,Early,51.8,136.08,77.11,149.69,362.87,Unlimited,SBD,F,
Girls,51.94,2,Matty Boswell,Early,51.71,131.54,77.11,136.08,344.73,Unlimited,SBD,F,
Girls,51.94,3,Elaine Zhuang,Ballinger,50.89,129.27,54.43,127.01,310.71,Unlimited,SBD,F,
Girls,51.94,4,Andrea Lopez,San Angelo Lake View,51.35,92.99,31.75,111.13,235.87,Unlimited,SBD,F,
Girls,51.94,5,Destinie Castro,San Angelo Lake View,50.53,81.65,40.82,90.72,213.19,Unlimited,SBD,F,
Girls,51.94,6,Rhylie Brewer,Lampasas,50.62,86.18,45.36,74.84,206.38,Unlimited,SBD,F,
Girls,51.94,7,Lilly Dykes,Lampasas,50.71,70.31,47.63,88.45,206.38,Unlimited,SBD,F,
Girls,51.94,8,Ashley Robinson,Brownwood,49.35,79.38,34.02,86.18,199.58,Unlimited,SBD,F,
Girls,51.94,9,Juliet Cardona,Lampasas,50.35,58.97,29.48,72.57,161.03,Unlimited,SBD,F,
Girls,56.02,1,Alexa Hernandez,Early,54.52,156.49,97.52,154.22,408.23,Unlimited,SBD,F,
Girls,56.02,2,Chloey Powell,Brady,55.93,95.25,52.16,102.06,249.48,Unlimited,SBD,F,
Girls,56.02,3,Esmee Flores,San Angelo Lake View,55.34,90.72,54.43,90.72,235.87,Unlimited,SBD,F,
Girls,56.02,4,Keni Drennan,Ballinger,54.79,90.72,43.09,86.18,219.99,Unlimited,SBD,F,
Girls,56.02,5,Mikenzie Halfmann,Ballinger,54.7,81.65,43.09,83.91,208.65,Unlimited,SBD,F,
Girls,56.02,6,Makenzie Long,Marble Falls,53.34,79.38,38.56,83.91,201.85,Unlimited,SBD,F,
Girls,60.1,1,Raelyn Graff,Brady,56.25,136.08,63.5,113.4,312.98,Unlimited,SBD,F,
Girls,60.1,2,Caitlynn Keeling,San Angelo TLC Academy,59.06,124.74,63.5,106.59,294.84,Unlimited,SBD,F,
Girls,60.1,3,London Delgado,Brownwood,58.6,111.13,56.7,111.13,278.96,Unlimited,SBD,F,
Girls,60.1,4,Ava Barnes,San Angelo Lake View,57.61,102.06,65.77,104.33,272.16,Unlimited,SBD,F,
Girls,60.1,5,Layla Weedon,Brownwood,59.24,102.06,56.7,102.06,260.82,Unlimited,SBD,F,
Girls,60.1,6,Kynlee Palmer,Ballinger,59.69,90.72,47.63,113.4,251.74,Unlimited,SBD,F,
Girls,60.1,7,Jillian Rodriguez,Ballinger,57.24,102.06,43.09,104.33,249.48,Unlimited,SBD,F,
Girls,60.1,8,Maddie Moerbe,Brady,57.42,86.18,49.9,104.33,240.4,Unlimited,SBD,F,
Girls,60.1,9,Emily Gonzalez,Lampasas,58.6,92.99,43.09,102.06,238.14,Unlimited,SBD,F,
Girls,60.1,10,Nicole Wolf,San Angelo Grape Creek,56.15,81.65,45.36,99.79,226.8,Unlimited,SBD,F,
Girls,60.1,11,Alondra Ramirez,Brady,57.92,74.84,49.9,90.72,215.46,Unlimited,SBD,F,
Girls,60.1,12,Tristin Rubio,San Angelo TLC Academy,56.25,79.38,43.09,90.72,213.19,Unlimited,SBD,F,
Girls,60.1,DQ,Ella Fritz,Ballinger,58.06,90.72,52.16,,,Unlimited,SBD,F,
Girls,67.36,1,Samantha Trevino,San Angelo TLC Academy,65.32,131.54,61.23,142.88,335.66,Unlimited,SBD,F,
Girls,67.36,2,Jordana Milioni,San Angelo TLC Academy,67.31,136.08,68.04,113.4,317.51,Unlimited,SBD,F,
Girls,67.36,3,Harper Cole,Comfort,64.41,102.06,45.36,115.67,263.08,Unlimited,SBD,F,
Girls,67.36,4,Cheyenne Blair,Marble Falls,60.78,99.79,56.7,95.25,251.74,Unlimited,SBD,F,
Girls,67.36,5,Addison Welch,Brownwood,60.78,92.99,52.16,102.06,247.21,Unlimited,SBD,F,
Girls,67.36,6,Jozlin Emfinger,San Angelo Lake View,62.6,90.72,58.97,97.52,247.21,Unlimited,SBD,F,
Girls,67.36,7,Amiyah Avalos,Brownwood,64.95,88.45,52.16,97.52,238.14,Unlimited,SBD,F,
Girls,67.36,8,Heaven Alambar,San Angelo Lake View,61.78,81.65,56.7,92.99,231.33,Unlimited,SBD,F,
Girls,67.36,9,Kaytlyn Smith,Brownwood,65.59,81.65,49.9,95.25,226.8,Unlimited,SBD,F,
Girls,67.36,10,Lenia Weichert,Ballinger,61.51,86.18,47.63,88.45,222.26,Unlimited,SBD,F,
Girls,67.36,11,Josslyn Romine,Lampasas,62.96,77.11,43.09,88.45,208.65,Unlimited,SBD,F,
Girls,67.36,12,Makayla Johnson,Lampasas,66.13,77.11,40.82,83.91,201.85,Unlimited,SBD,F,
Girls,67.36,13,Phoenix Jurgens,San Angelo Grape Creek,63.59,68.04,40.82,90.72,199.58,Unlimited,SBD,F,
Girls,67.36,14,Trinity Sager,San Angelo TLC Academy,62.14,68.04,34.02,79.38,181.44,Unlimited,SBD,F,
Girls,67.36,DQ,Kylie Villarreal,Ballinger,65.59,,,,,Unlimited,SBD,F,
Girls,75.07,1,Gracie Galindo,Brady,74.21,158.76,79.38,142.88,381.02,Unlimited,SBD,F,
Girls,75.07,2,Addison Berry,Lampasas,74.48,131.54,77.11,142.88,351.53,Unlimited,SBD,F,
Girls,75.07,3,Hannah Haddon,Ballinger,74.66,122.47,58.97,131.54,312.98,Unlimited,SBD,F,
Girls,75.07,4,Jaslin Jones,Brownwood,68.22,120.2,63.5,127.01,310.71,Unlimited,SBD,F,
Girls,75.07,5,Jordyn Werner,Brady,71.21,129.27,54.43,120.2,303.91,Unlimited,SBD,F,
Girls,75.07,6,Bethany Fry,Marble Falls,74.57,113.4,54.43,129.27,297.1,Unlimited,SBD,F,
Girls,75.07,7,Serenity Sales,Lampasas,74.3,90.72,72.57,120.2,283.5,Unlimited,SBD,F,
Girls,75.07,8,Sarah Holland,Comfort,72.39,86.18,49.9,106.59,242.67,Unlimited,SBD,F,
Girls,75.07,9,Atlanta Olguin,Brownwood,71.3,102.06,52.16,79.38,233.6,Unlimited,SBD,F,
Girls,75.07,10,Esperanza Villegas,Ballinger,69.67,79.38,54.43,97.52,231.33,Unlimited,SBD,F,
Girls,75.07,11,Dakota Chavez,San Angelo Grape Creek,70.4,74.84,40.82,108.86,224.53,Unlimited,SBD,F,
Girls,82.33,1,Alexis Dalton,Marble Falls,77.38,136.08,65.77,145.15,347,Unlimited,SBD,F,
Girls,82.33,2,Angelina Paez,San Angelo Lake View,80.92,124.74,88.45,124.74,337.93,Unlimited,SBD,F,
Girls,82.33,3,Kayli Devusser,Early,77.84,97.52,72.57,120.2,290.3,Unlimited,SBD,F,
Girls,82.33,4,Marlee Martinez,Early,80.47,117.93,61.23,111.13,290.3,Unlimited,SBD,F,
Girls,82.33,5,Cynthia Leos,Comfort,75.66,127.01,49.9,97.52,274.42,Unlimited,SBD,F,
Girls,82.33,6,Allisson Reyna,Brownwood,75.66,102.06,49.9,120.2,272.16,Unlimited,SBD,F,
Girls,82.33,7,Isabell Medina,Marble Falls,75.75,102.06,56.7,113.4,272.16,Unlimited,SBD,F,
Girls,82.33,8,Samantha Reyes,Brady,78.74,108.86,56.7,106.59,272.16,Unlimited,SBD,F,
Girls,82.33,9,Kelssey Aponte,San Angelo TLC Academy,78.2,104.33,40.82,86.18,231.33,Unlimited,SBD,F,
Girls,82.33,10,Macy Hernandez,San Angelo Grape Creek,76.02,92.99,38.56,97.52,229.06,Unlimited,SBD,F,
Girls,90.04,1,Jocelynn Huerta,San Angelo TLC Academy,88.36,190.51,90.72,165.56,446.79,Unlimited,SBD,F,
Girls,90.04,2,Kyber Zemlock,San Angelo TLC Academy,87.45,117.93,74.84,142.88,335.66,Unlimited,SBD,F,
Girls,90.04,3,Sarah Hernandez,San Angelo TLC Academy,85.28,136.08,65.77,117.93,319.78,Unlimited,SBD,F,
Girls,90.04,4,Sophia Pedraza,Marble Falls,84.82,102.06,56.7,104.33,263.08,Unlimited,SBD,F,
Girls,90.04,5,Natalie Gresko,Lampasas,83.1,83.91,54.43,102.06,240.4,Unlimited,SBD,F,
Girls,90.04,6,Angelina Shirley,Lampasas,84.01,86.18,47.63,90.72,224.53,Unlimited,SBD,F,
Girls,90.04,DQ,Aubrey Hernandez,Comfort,89.63,,,,,Unlimited,SBD,F,
Girls,100.02,1,Daniela Hernandez,Brady,92.08,158.76,99.79,136.08,394.63,Unlimited,SBD,F,
Girls,100.02,2,Amari Munoz,Lampasas,93.08,122.47,74.84,117.93,315.25,Unlimited,SBD,F,
Girls,100.02,3,Julyssa Sanchez,Brady,94.35,124.74,61.23,124.74,310.71,Unlimited,SBD,F,
Girls,100.02,4,Destiny Deanda,San Angelo TLC Academy,90.63,127.01,68.04,113.4,308.44,Unlimited,SBD,F,
Girls,100.02,5,Montserrat Fregoso,Marble Falls,99.06,129.27,58.97,120.2,308.44,Unlimited,SBD,F,
Girls,100.02,6,Mia Valenzuela,Comfort,95.62,120.2,61.23,122.47,303.91,Unlimited,SBD,F,
Girls,100.02,7,Amaya Colquitt,San Angelo Lake View,91.63,124.74,58.97,111.13,294.84,Unlimited,SBD,F,
Girls,100.02,8,Joanna Cerda,San Angelo Lake View,91.53,113.4,61.23,108.86,283.5,Unlimited,SBD,F,
Girls,100.02,9,Alexis Rojas,Comfort,93.98,115.67,40.82,108.86,265.35,Unlimited,SBD,F,
Girls,110,1,Genesis Lemon,Marble Falls,102.78,151.95,68.04,140.61,360.61,Unlimited,SBD,F,
Girls,110,2,Diandra Hernandez,Brady,100.7,149.69,72.57,127.01,349.27,Unlimited,SBD,F,
Girls,110,3,Adrian Bankston,San Angelo Lake View,100.15,124.74,86.18,106.59,317.51,Unlimited,SBD,F,
Girls,110,4,Michelle Villa,Comfort,104.24,120.2,56.7,113.4,290.3,Unlimited,SBD,F,
Girls,110,5,Aliyah Berndt,Brownwood,104.24,108.86,47.63,106.59,263.08,Unlimited,SBD,F,
Girls,110+,1,Janiya Jefferson,San Angelo Lake View,139.8,172.37,90.72,176.9,439.98,Unlimited,SBD,F,
Girls,110+,2,Samerra Reed,Brady,117.48,151.95,77.11,127.01,356.07,Unlimited,SBD,F,
Girls,110+,3,Joely Norton,Junction,146.24,61.23,43.09,61.23,165.56,Unlimited,SBD,F,
Girls,,NS,Lexy Dunham,Ballinger,,,,,,Unlimited,SBD,F,
Girls,,NS,Rayana Barzart,Early,,,,,,Unlimited,SBD,F,
Girls,,NS,Kenli Schwanderner,Ballinger,,,,,,Unlimited,SBD,F,
Girls,,NS,Amaya Cabrera,Goldthwaite,,,,,,Unlimited,SBD,F,
