Division,WeightClassKg,Place,Name,Team,BodyweightKg,Best3SquatKg,Best3BenchKg,Best3DeadliftKg,TotalKg,Equipment,Event,Sex
Boys,51.71,1,Christian Cavazos,Donna,48.76,92.99,52.16,106.59,251.74,Single-ply,SBD,M
Boys,51.71,2,Rigo Medina,Donna,48.58,88.45,54.43,104.33,247.21,Single-ply,SBD,M
Boys,51.71,3,Damian Palomo,Weslaco,51.07,81.65,34.02,97.52,213.19,Single-ply,SBD,M
Boys,55.79,1,Raul Mota,San Benito,55.66,154.22,115.67,185.97,455.86,Single-ply,SBD,M
Boys,55.79,2,Ralph Zapata,Rio Hondo,55.79,158.76,92.99,156.49,408.23,Single-ply,SBD,M
Boys,55.79,3,Edgar Hernandez,Brownsville Rivera,54.66,138.35,79.38,147.42,365.14,Single-ply,SBD,M
Boys,55.79,4,Eli Saldana,Santa Rosa,55.57,83.91,79.38,108.86,272.16,Single-ply,SBD,M
Boys,59.87,1,Louis Vasquez,Los Fresnos,58.47,165.56,102.06,183.7,451.32,Single-ply,SBD,M
Boys,59.87,2,Ben Guajardo,Mission Sharyland,59.69,149.69,95.25,170.1,415.04,Single-ply,SBD,M
Boys,59.87,3,Randy Medillin,San Benito,58.79,151.95,92.99,161.03,405.97,Single-ply,SBD,M
Boys,59.87,4,Alexis Hernandez,Donna,58.06,145.15,99.79,149.69,394.63,Single-ply,SBD,M
Boys,67.13,5,Adrian Torres,La Feria,59.96,154.22,79.38,161.03,394.63,Single-ply,SBD,M
Boys,59.87,6,Julian Vasquez,San Benito,59.19,151.95,90.72,145.15,387.82,Single-ply,SBD,M
Boys,67.13,7,Mike Tamez,Donna,60.06,136.08,83.91,167.83,387.82,Single-ply,SBD,M
Boys,59.87,8,Danny Diaz,Brownsville Lopez,59.38,117.93,113.4,151.95,383.29,Single-ply,SBD,M
Boys,59.87,9,Arturo Galindo,Brownsville Hanna,57.38,120.2,65.77,147.42,333.39,Single-ply,SBD,M
Boys,59.87,10,Jordan Magallanes,Weslaco,58.56,106.59,70.31,111.13,288.03,Single-ply,SBD,M
Boys,59.87,11,Joel Guerrero,Donna,59.28,92.99,47.63,122.47,263.08,Single-ply,SBD,M
Boys,67.13,1,Toby Torres,San Benito,66.77,172.37,117.93,217.72,508.02,Single-ply,SBD,M
Boys,67.13,2,Alan Alfaro,Rio Hondo,66,170.1,108.86,215.46,494.42,Single-ply,SBD,M
Boys,67.13,3,Jaime Gonzalez,Port Isabel,63.87,170.1,108.86,174.63,453.59,Single-ply,SBD,M
Boys,67.13,4,Luis Marina,Mission Sharyland,67,154.22,108.86,190.51,453.59,Single-ply,SBD,M
Boys,67.13,5,Azul Barrientos,Los Fresnos,66,151.95,99.79,192.78,444.52,Single-ply,SBD,M
Boys,67.13,6,Anthony Noyola,San Benito,66.27,156.49,115.67,163.29,435.45,Single-ply,SBD,M
Boys,67.13,7,David Garza,Brownsville Veterans Memorial,65.77,149.69,106.59,176.9,433.18,Single-ply,SBD,M
Boys,67.13,8,Juan Castillo,Brownsville Lopez,66.18,158.76,102.06,147.42,408.23,Single-ply,SBD,M
Boys,67.13,9,Julian Flores,Rio Hondo,65.5,138.35,113.4,151.95,403.7,Single-ply,SBD,M
Boys,67.13,10,Danny Rueda,Brownsville Rivera,66.18,136.08,106.59,149.69,392.36,Single-ply,SBD,M
Boys,67.13,11,Rafael Ledezma,Brownsville Porter,65.59,145.15,92.99,147.42,385.55,Single-ply,SBD,M
Boys,67.13,12,Frank Zeferris,Brownsville Rivera,60.19,133.81,97.52,149.69,381.02,Single-ply,SBD,M
Boys,67.13,13,Rogelio Pulido,Brownsville Lopez,63.78,120.2,83.91,172.37,376.48,Single-ply,SBD,M
Boys,67.13,14,Albert Vasquez,La Feria,66.68,145.15,74.84,142.88,362.87,Single-ply,SBD,M
Boys,67.13,15,Hugo Salas,Brownsville Lopez,63.59,142.88,72.57,145.15,360.61,Single-ply,SBD,M
Boys,67.13,16,Yayo Segura,Brownsville Pace,65.5,122.47,79.38,136.08,337.93,Single-ply,SBD,M
Boys,67.13,17,Ronalado Longoria,Mission Sharyland,63.59,124.74,68.04,136.08,328.85,Single-ply,SBD,M
Boys,67.13,18,Tyler Rodriguez,Brownsville Veterans Memorial,60.19,124.74,70.31,127.01,322.05,Single-ply,SBD,M
Boys,67.13,19,Jonathon Elizondo,Santa Rosa,60.69,102.06,79.38,136.08,317.51,Single-ply,SBD,M
Boys,67.13,20,Bradley Salinas,Brownsville Porter,63.09,108.86,56.7,145.15,310.71,Single-ply,SBD,M
Boys,67.13,21,JJ Camacho,Brownsville Pace,60.87,102.06,74.84,111.13,288.03,Single-ply,SBD,M
Boys,67.13,DQ,Javier Guzman,Rio Hondo,63.68,83.91,,,,Single-ply,SBD,M
Boys,74.84,1,Richard Martinez,Brownsville Hanna,74.57,179.17,129.27,183.7,492.15,Single-ply,SBD,M
Boys,82.1,2,Wally Olivarez,Santa Rosa,74.98,181.44,124.74,183.7,489.88,Single-ply,SBD,M
Boys,74.84,3,Steven Ambriz,Brownsville Hanna,74.07,176.9,120.2,183.7,480.81,Single-ply,SBD,M
Boys,74.84,4,John Martinez,Port Isabel,72.98,176.9,108.86,181.44,467.2,Single-ply,SBD,M
Boys,74.84,5,Chain Camacho,Port Isabel,70.49,170.1,117.93,176.9,464.93,Single-ply,SBD,M
Boys,74.84,6,Guadalupe Camacho,Brownsville Lopez,71.58,145.15,99.79,190.51,435.45,Single-ply,SBD,M
Boys,82.1,7,Luis Rodriguez #11,Brownsville Veterans Memorial,74.98,163.29,111.13,154.22,428.64,Single-ply,SBD,M
Boys,74.84,8,Juan Zamora,Brownsville Porter,74.3,140.61,86.18,183.7,410.5,Single-ply,SBD,M
Boys,74.84,9,Aaron Sanchez,Weslaco,74.39,136.08,97.52,161.03,394.63,Single-ply,SBD,M
Boys,74.84,10,Luciano Ramos,Brownsville Porter,69.99,138.35,83.91,158.76,381.02,Single-ply,SBD,M
Boys,74.84,11,Christopher Olivarez,La Feria,68.76,129.27,72.57,154.22,356.07,Single-ply,SBD,M
Boys,74.84,12,Eric Ginez,Donna,69.67,124.74,79.38,142.88,347,Single-ply,SBD,M
Boys,74.84,13,Jacob Castaneda,Santa Rosa,67.49,97.52,70.31,136.08,303.91,Single-ply,SBD,M
Boys,74.84,DQ,Ashton Colunga,Brownsville Hanna,72.89,77.11,65.77,,,Single-ply,SBD,M
Boys,82.1,1,Javi Cruz,Los Fresnos,79.97,226.8,113.4,267.62,607.81,Single-ply,SBD,M
Boys,82.1,2,Miguel Herrera,Donna,81.78,213.19,138.35,197.31,548.85,Single-ply,SBD,M
Boys,82.1,3,Joey Guzman,Rio Hondo,77.29,165.56,111.13,199.58,476.27,Single-ply,SBD,M
Boys,82.1,4,Eliseo Garzoria,Los Fresnos,78.2,165.56,97.52,213.19,476.27,Single-ply,SBD,M
Boys,82.1,5,Steven Martinez,Port Isabel,82.05,174.63,106.59,170.1,451.32,Single-ply,SBD,M
Boys,82.1,6,Steven Mercado,Mission Sharyland,80.69,142.88,124.74,181.44,449.06,Single-ply,SBD,M
Boys,82.1,7,Daniel Flores,Rio Hondo,80.38,183.7,111.13,151.95,446.79,Single-ply,SBD,M
Boys,82.1,8,Oscar Lopez,Los Fresnos,79.97,142.88,106.59,183.7,433.18,Single-ply,SBD,M
Boys,82.1,9,John Bowen,Brownsville Rivera,75.8,156.49,108.86,147.42,412.77,Single-ply,SBD,M
Boys,82.1,10,Frank De Santiago,Weslaco,80.56,142.88,86.18,163.29,392.36,Single-ply,SBD,M
Boys,82.1,11,David Cantu,Mission Sharyland,79.88,136.08,83.91,156.49,376.48,Single-ply,SBD,M
Boys,89.81,12,Frank Saucedo,Santa Rosa,82.19,136.08,88.45,147.42,371.95,Single-ply,SBD,M
Boys,82.1,13,Andres Zeloya,Brownsville Rivera,80.69,124.74,90.72,151.95,367.41,Single-ply,SBD,M
Boys,82.1,14,Bryan Silva,Brownsville Rivera,78.38,124.74,83.91,142.88,351.53,Single-ply,SBD,M
Boys,82.1,15,Eddie Molina,San Benito,80.47,113.4,74.84,161.03,349.27,Single-ply,SBD,M
Boys,82.1,16,Mauri Aguilar,Brownsville Pace,76.48,113.4,79.38,142.88,335.66,Single-ply,SBD,M
Boys,82.1,17,Christian Badillo,Santa Rosa,82.05,97.52,65.77,136.08,299.37,Single-ply,SBD,M
Boys,82.1,DQ,Ricardo Carlos,Brownsville Veterans Memorial,75.57,174.63,108.86,,,Single-ply,SBD,M
Boys,89.81,DQ,Roger Tapia,Brownsville Veterans Memorial,82.24,,,,,Single-ply,SBD,M
Boys,82.1,DQ,Jacob Gracia,Weslaco,75.66,,,,,Single-ply,SBD,M
Boys,82.1,DQ,Pablo Garza,Brownsville Pace,81.56,142.88,,,,Single-ply,SBD,M
Boys,89.81,1,Ramon Sauceda,La Feria,88.59,249.48,158.76,249.48,657.71,Single-ply,SBD,M
Boys,89.81,2,JJ Barrientes,Brownsville Hanna,87.27,208.65,142.88,197.31,548.85,Single-ply,SBD,M
Boys,89.81,3,Frankie Almanza,Los Fresnos,83.28,206.38,124.74,213.19,544.31,Single-ply,SBD,M
Boys,89.81,4,Stephen Dorado,Rio Hondo,86.59,183.7,151.95,183.7,519.36,Single-ply,SBD,M
Boys,89.81,5,Isaiah Heredia,Rio Hondo,86.18,174.63,122.47,204.12,501.22,Single-ply,SBD,M
Boys,89.81,6,Abram Ramirez,Rio Hondo,83.87,188.24,124.74,183.7,496.68,Single-ply,SBD,M
Boys,89.81,7,Tristan Echavarria,Donna,89.68,185.97,117.93,192.78,496.68,Single-ply,SBD,M
Boys,99.79,8,Rick Sauceda,Brownsville Lopez,89.99,176.9,127.01,183.7,487.61,Single-ply,SBD,M
Boys,89.81,9,Andres Lucio,Brownsville Rivera,82.87,188.24,122.47,172.37,483.08,Single-ply,SBD,M
Boys,89.81,10,Eddie Garcia,Brownsville Hanna,88.36,188.24,106.59,170.1,464.93,Single-ply,SBD,M
Boys,89.81,11,Antonio Ruiz,Brownsville Porter,89.09,158.76,106.59,192.78,458.13,Single-ply,SBD,M
Boys,89.81,12,Daniel Garza,Brownsville Pace,84.28,151.95,124.74,172.37,449.06,Single-ply,SBD,M
Boys,89.81,13,Pedro Ramos,Brownsville Pace,89.68,183.7,97.52,154.22,435.45,Single-ply,SBD,M
Boys,89.81,14,Frank Alvarado,Brownsville Porter,85.28,167.83,77.11,176.9,421.84,Single-ply,SBD,M
Boys,89.81,15,Aaron Saldana,Brownsville Rivera,87.09,161.03,88.45,161.03,410.5,Single-ply,SBD,M
Boys,89.81,16,Edward Salinas,Weslaco,83.6,133.81,88.45,102.06,324.32,Single-ply,SBD,M
Boys,89.81,DQ,Steven Martinez,Weslaco,86.68,142.88,,,,Single-ply,SBD,M
Boys,99.79,1,Angel Mercado,Donna,99.16,235.87,124.74,249.48,610.08,Single-ply,SBD,M
Boys,99.79,2,Edgar Ortegon,Brownsville Lopez,93.89,244.94,127.01,222.26,594.21,Single-ply,SBD,M
Boys,99.79,3,Erick Vasquez #3,Brownsville Veterans Memorial,96.3,210.92,136.08,204.12,551.11,Single-ply,SBD,M
Boys,99.79,4,Lalo Buenrostro,San Benito,97.39,204.12,117.93,204.12,526.17,Single-ply,SBD,M
Boys,99.79,5,Israel Torres,La Feria,99.16,190.51,131.54,195.04,517.1,Single-ply,SBD,M
Boys,99.79,6,Mark Garcia,Brownsville Porter,97.89,185.97,108.86,185.97,480.81,Single-ply,SBD,M
Boys,99.79,7,Joey Torres,Brownsville Lopez,92.67,172.37,120.2,145.15,437.72,Single-ply,SBD,M
Boys,99.79,8,Javier Elizondo,Mission Sharyland,93.39,102.06,102.06,181.44,385.55,Single-ply,SBD,M
Boys,99.79,DQ,Librado Lozano,Brownsville Porter,94.08,154.22,72.57,163.29,,Single-ply,SBD,M
Boys,99.79,DQ,Jonathan Ojeda,Brownsville Pace,93.49,81.65,,,,Single-ply,SBD,M
Boys,109.77,1,Jacob Alaniz,Brownsville Veterans Memorial,100.97,258.55,151.95,258.55,669.05,Single-ply,SBD,M
Boys,109.77,2,Steven Rodriguez,San Benito,101.47,210.92,149.69,242.67,603.28,Single-ply,SBD,M
Boys,109.77,3,Luis Martinez,San Benito,105.78,204.12,158.76,206.38,569.26,Single-ply,SBD,M
Boys,109.77,4,Marco Gutierrez,La Feria,107.86,219.99,142.88,204.12,566.99,Single-ply,SBD,M
Boys,109.77,5,Caleb Robertson,Rio Hondo,108.5,238.14,113.4,195.04,546.58,Single-ply,SBD,M
Boys,109.77,6,Robert Payan,Brownsville Porter,101.97,188.24,124.74,199.58,512.56,Single-ply,SBD,M
Boys,109.77,7,Brian Lawrence,Brownsville Veterans Memorial,104.19,190.51,117.93,195.04,503.49,Single-ply,SBD,M
Boys,109.77,8,Kevin Gonzalez,Brownsville Rivera,101.7,204.12,115.67,176.9,496.68,Single-ply,SBD,M
Boys,109.77,9,Matthew Trinidad,Brownsville Hanna,108.59,192.78,127.01,165.56,485.34,Single-ply,SBD,M
Boys,109.77,10,Daniel Gonzalez,Brownsville Pace,104.37,158.76,88.45,142.88,390.09,Single-ply,SBD,M
Boys,109.77,11,Enrico Rivas,Weslaco,106.96,133.81,97.52,124.74,356.07,Single-ply,SBD,M
Boys,109.77,DQ,Guadalupe Nava,Brownsville Rivera,108.68,206.38,,,,Single-ply,SBD,M
Boys,124.74,1,Alex Briseno,Brownsville Rivera,119.98,294.84,204.12,249.48,748.43,Single-ply,SBD,M
Boys,124.74,2,Keith Mora,Mission Sharyland,121.7,294.84,147.42,235.87,678.12,Single-ply,SBD,M
Boys,124.74,3,Josh Mohanadas,Mission Sharyland,113.99,235.87,156.49,244.94,637.3,Single-ply,SBD,M
Boys,124.74,4,Jesse Guzman,Brownsville Veterans Memorial,115.76,240.4,142.88,213.19,596.47,Single-ply,SBD,M
Boys,124.74,5,Ruben Cisneros,Donna,121.7,235.87,122.47,219.99,578.33,Single-ply,SBD,M
Boys,124.74,6,Cristo de la Cruz,Brownsville Pace,123.47,204.12,104.33,195.04,503.49,Single-ply,SBD,M
Boys,124.74,7,Josh Castillo,Brownsville Pace,114.26,199.58,129.27,170.1,498.95,Single-ply,SBD,M
Boys,124.74,8,Jose Encina,Brownsville Hanna,110.09,183.7,117.93,188.24,489.88,Single-ply,SBD,M
Boys,124.74,9,Josh Perez,Donna,118.48,170.1,108.86,170.1,449.06,Single-ply,SBD,M
Boys,124.74,10,Josh Zavala,Weslaco,123.38,142.88,102.06,165.56,410.5,Single-ply,SBD,M
Boys,124.74+,1,John Reyes #2,Rio Hondo,142.79,285.76,158.76,226.8,671.32,Single-ply,SBD,M
Boys,124.74+,2,Mando Castillo,Brownsville Lopez,132.36,231.33,142.88,240.4,614.62,Single-ply,SBD,M
Boys,124.74+,3,Cristian Sanchez,San Benito,145.29,238.14,165.56,204.12,607.81,Single-ply,SBD,M
Boys,124.74+,4,Mario DeLeon,La Feria,139.03,233.6,133.81,219.99,587.4,Single-ply,SBD,M
Boys,124.74+,5,Gage Rivas,Brownsville Veterans Memorial,135.17,215.46,154.22,195.04,564.72,Single-ply,SBD,M
Boys,124.74+,6,Kevin Garcia,Brownsville Porter,125.78,183.7,106.59,188.24,478.54,Single-ply,SBD,M
Boys,124.74+,7,Victor Rodriguez,Brownsville Pace,126.87,158.76,90.72,142.88,392.36,Single-ply,SBD,M
Boys,124.74+,8,Abraham Martinez,Brownsville Porter,144.11,163.29,102.06,,265.35,Single-ply,SB,M
Boys,124.74+,DQ,Enrique Coy,Weslaco,127.01,,,,,Single-ply,SB,M
Boys,,NS,Michael Vento,La Feria,,,,,,Single-ply,SB,M
