Division,WeightClassKg,Place,Name,Team,BodyweightKg,Best3SquatKg,Best3BenchKg,Best3DeadliftKg,TotalKg,Equipment,Event,Sex,BirthDate
Boys,55.79,1,Juan Guerrero,Channelview,55.25,131.54,83.91,142.88,358.34,Unlimited,SBD,M,
Boys,55.79,2,Javier Lagunas,Houston Northbrook,55.79,131.54,77.11,133.81,342.46,Unlimited,SBD,M,
Boys,59.87,1,Steven Tran,Houston Aldine,59.78,181.44,81.65,206.38,469.47,Unlimited,SBD,M,
Boys,74.84,1,Jacob Parson,Houston Northbrook,74.84,183.7,120.2,204.12,508.02,Unlimited,SBD,M,
Boys,74.84,2,Rocky Sanchez,Houston Eisenhower,73.21,138.35,83.91,167.83,390.09,Unlimited,SBD,M,
Boys,74.84,3,Daniel Willis,Crosby,69.4,142.88,77.11,154.22,374.21,Unlimited,SBD,M,
Boys,74.84,4,Javien Powell,Crosby,74.84,136.08,68.04,151.95,356.07,Unlimited,SBD,M,
Boys,74.84,5,William Tolliver,Houston Nimitz,71.21,127.01,79.38,138.35,344.73,Unlimited,SBD,M,
Boys,74.84,DQ,Kevin Flores,Houston Northbrook,74.84,188.24,,,,Unlimited,SBD,M,
Boys,82.1,1,Jayden Jackson,Houston Eisenhower,82.1,145.15,92.99,145.15,383.29,Unlimited,SBD,M,
Boys,82.1,2,Julian Canales,Houston Aldine,82.1,117.93,72.57,154.22,344.73,Unlimited,SBD,M,
Boys,89.81,1,Levi Fontenot,Crosby,87,249.48,124.74,242.67,616.89,Unlimited,SBD,M,
Boys,89.81,2,Adan McGuffin,Katy,87.63,233.6,154.22,210.92,598.74,Unlimited,SBD,M,
Boys,89.81,3,Oscar Manzanares,Channelview,83.46,204.12,111.13,190.51,505.76,Unlimited,SBD,M,
Boys,89.81,4,Alexander Silva,Houston Aldine,89.81,158.76,97.52,172.37,428.64,Unlimited,SBD,M,
Boys,89.81,5,Manuel Ayala,Houston Aldine,89.81,215.46,104.33,183.7,503.49,Unlimited,SBD,M,
Boys,89.81,5,Miguel Ayala,Houston Aldine,84.73,136.08,83.91,172.37,392.36,Unlimited,SBD,M,
Boys,99.79,1,Salatiel Trujillo,Houston Aldine,91.17,213.19,149.69,249.48,612.35,Unlimited,SBD,M,
Boys,99.79,2,Joseph Escalante,Channelview,98.34,235.87,127.01,210.92,573.79,Unlimited,SBD,M,
Boys,99.79,4,Mario Galvan,Houston Aldine,99.79,208.65,106.59,156.49,471.74,Unlimited,SBD,M,
Boys,99.79,5,Anthony Murillo,Houston Northbrook,99.79,183.7,108.86,179.17,471.74,Unlimited,SBD,M,
Boys,99.79,6,Moises Perales,Crosby,99.79,154.22,108.86,172.37,435.45,Unlimited,SBD,M,
Boys,99.79,7,Galvin Lyles,Houston Benjamin Davis Sr,93.53,120.2,79.38,129.27,328.85,Unlimited,SBD,M,
Boys,99.79,DQ,Samuel Saravia,Houston Aldine,99.79,149.69,88.45,,,Unlimited,SBD,M,
Boys,99.79,DQ,Diego Montes,Houston Northbrook,99.79,,,,,Unlimited,SBD,M,
Boys,109.77,1,Tyler Willis,Katy,108.32,274.42,188.24,272.16,734.82,Unlimited,SBD,M,
Boys,109.77,2,Gavin Ramirez,Crosby,109.77,272.16,142.88,224.53,639.57,Unlimited,SBD,M,
Boys,109.77,3,Kellyn Husband,Coldspring-Oakhurst,101.15,226.8,188.24,210.92,625.96,Unlimited,SBD,M,
Boys,109.77,3,Jarrell Jackson,Houston Eisenhower,100.06,142.88,129.27,204.12,476.27,Unlimited,SBD,M,
Boys,109.77,4,Maximus Jackson,Houston Benjamin Davis Sr,101.42,206.38,124.74,204.12,535.24,Unlimited,SBD,M,
Boys,109.77,6,Jimmy Garner,Channelview,108.5,183.7,127.01,172.37,483.08,Unlimited,SBD,M,
Boys,109.77,7,Peter Hernandez,Houston Northbrook,109.77,170.1,102.06,179.17,451.32,Unlimited,SBD,M,
Boys,109.77,8,Christian Moreno,Houston Aldine,109.77,149.69,83.91,174.63,408.23,Unlimited,SBD,M,
Boys,109.77,9,Alonso Herrera,Houston Benjamin Davis Sr,104.96,151.95,102.06,142.88,396.89,Unlimited,SBD,M,
Boys,109.77,10,William SantaRita,Houston Aldine,109.77,149.69,83.91,140.61,374.21,Unlimited,SBD,M,
Boys,109.77,11,Cal Lawrence,Houston Benjamin Davis Sr,106.59,,115.67,188.24,303.91,Unlimited,BD,M,
Boys,124.74,1,Albert Gonzales,Houston Northbrook,120.66,269.89,183.7,258.55,712.14,Unlimited,SBD,M,
Boys,124.74,2,Axel Amaya,Houston Northbrook,124.74,258.55,176.9,208.65,644.1,Unlimited,SBD,M,
Boys,124.74,3,Juan Rangel,Houston Northbrook,110.22,204.12,149.69,226.8,580.6,Unlimited,SBD,M,
Boys,124.74,4,Felix Banda,Houston Northbrook,124.74,226.8,136.08,199.58,562.45,Unlimited,SBD,M,
Boys,124.74,5,Santiago Rodriguez,Houston Aldine,124.74,226.8,113.4,195.04,535.24,Unlimited,SBD,M,
Boys,124.74,6,Shane Aguilar,Channelview,124.74,199.58,129.27,204.12,532.97,Unlimited,SBD,M,
Boys,124.74,7,Nicolas Chenevert,Houston Benjamin Davis Sr,122.38,165.56,120.2,156.49,442.25,Unlimited,SBD,M,
Boys,124.74,8,Diego Matamoros,Houston Benjamin Davis Sr,111.13,161.03,77.11,181.44,419.57,Unlimited,SBD,M,
Boys,124.74,DQ,Nathaniel O'Flaherty,Crosby,124.74,,,,,Unlimited,SBD,M,
Boys,139.71,1,Joshua Torres,Channelview,127.73,235.87,142.88,233.6,612.35,Unlimited,SBD,M,
Boys,139.71,2,Maycol Aquino,Houston Northbrook,139.71,165.56,79.38,176.9,421.84,Unlimited,SBD,M,
Boys,139.71,3,Christopher Romero,Houston Eisenhower,139.71,127.01,90.72,176.9,394.63,Unlimited,SBD,M,
Boys,139.71,4,Sedrick Steptoe,Houston Eisenhower,131.54,113.4,81.65,154.22,349.27,Unlimited,SBD,M,
Boys,139.71,5,Tre Richardson,Houston Benjamin Davis Sr,139.71,,142.88,204.12,347,Unlimited,BD,M,
Boys,139.71,6,Hunter Cedoz,Houston Aldine,127.64,129.27,68.04,127.01,324.32,Unlimited,SBD,M,
Boys,139.71+,1,Aden Boutte,Channelview,153.13,306.17,176.9,272.16,755.23,Unlimited,SBD,M,
Boys,139.71+,DQ,Aanson Johnson,Crosby,166.92,183.7,,,,Unlimited,SBD,M,
