Division,WeightClassKg,Place,Name,Team,BodyweightKg,Best3SquatKg,Best3BenchKg,Best3DeadliftKg,TotalKg,Equipment,Event,Sex,BirthDate
Boys,51.71,1,Xavier Marroquin,Strawn,46.81,83.91,52.16,83.91,219.99,Single-ply,SBD,M,
Boys,51.71,2,Joel Jones,Perrin-Whitt,50.8,88.45,36.29,95.25,219.99,Single-ply,SBD,M,
Boys,59.87,1,Logan Turner,Perrin-Whitt,59.6,131.54,90.72,140.61,362.87,Single-ply,SBD,M,
Boys,59.87,2,Colten Morgan,Roscoe Highland,58.97,104.33,63.5,136.08,303.91,Single-ply,SBD,M,
Boys,67.13,1,Trenton Sizemore,Strawn,65.95,167.83,90.72,170.1,428.64,Single-ply,SBD,M,
Boys,67.13,2,Levi Muncy,Roscoe Highland,63.41,161.03,79.38,154.22,394.63,Single-ply,SBD,M,
Boys,67.13,3,Casey Beach,Perrin-Whitt,64.32,129.27,88.45,149.69,367.41,Single-ply,SBD,M,
Boys,67.13,4,Brody Strew,Sidney,66.22,111.13,70.31,185.97,367.41,Single-ply,SBD,M,
Boys,67.13,5,Jace Green,Jonesboro,65.05,90.72,61.23,131.54,283.5,Single-ply,SBD,M,
Boys,67.13,NS,Eric Thurman,Jonesboro,,,,,,Single-ply,SBD,M,
Boys,74.84,1,Jaden Domel,Jonesboro,69.49,147.42,86.18,151.95,385.55,Single-ply,SBD,M,
Boys,74.84,2,Blayne Bankhead,Roscoe Highland,71.76,136.08,65.77,151.95,353.8,Single-ply,SBD,M,
Boys,74.84,3,Kaden Carpenter,Lingleville,73.39,122.47,58.97,138.35,319.78,Single-ply,SBD,M,
Boys,82.1,1,Tristen Harding,Roscoe Highland,80.1,190.51,102.06,204.12,496.68,Single-ply,SBD,M,
Boys,82.1,2,Quay Lloyd,Roscoe Highland,76.93,138.35,86.18,190.51,415.04,Single-ply,SBD,M,
Boys,82.1,3,Jaxson Bays,Lingleville,76.84,97.52,70.31,145.15,312.98,Single-ply,SBD,M,
Boys,82.1,DQ,Bowen Williams,Lingleville,80.56,147.42,,145.15,,Single-ply,SBD,M,
Boys,82.1,NS,Ben Spaulding,Roscoe Highland,,,,,,Single-ply,SBD,M,
Boys,89.81,1,Jett Millsop,Strawn,85.09,217.72,113.4,172.37,503.49,Single-ply,SBD,M,
Boys,89.81,2,Justice Baker #1,Strawn,84.19,210.92,104.33,181.44,496.68,Single-ply,SBD,M,
Boys,89.81,3,Caleb Christel,Jonesboro,86.73,147.42,88.45,183.7,419.57,Single-ply,SBD,M,
Boys,89.81,4,Justin Patton,Strawn,86,142.88,81.65,154.22,378.75,Single-ply,SBD,M,
Boys,99.79,1,Lorenzo Garcia,Strawn,95.29,272.16,136.08,215.46,623.69,Single-ply,SBD,M,
Boys,99.79,2,Kreed Turney,Roscoe Highland,96.62,222.26,145.15,249.48,616.89,Single-ply,SBD,M,
Boys,99.79,3,Jose Estrada,Strawn,90.17,226.8,122.47,181.44,530.7,Single-ply,SBD,M,
Boys,99.79,4,Owen Cardiel,Perrin-Whitt,98.88,161.03,90.72,147.42,399.16,Single-ply,SBD,M,
Boys,109.77,1,Nate Bennett,Roscoe Highland,102.97,217.72,117.93,249.48,585.13,Single-ply,SBD,M,
Boys,109.77,2,Tate Cain,Roscoe Highland,104.78,154.22,122.47,199.58,476.27,Single-ply,SBD,M,
Boys,109.77,3,Damian Ortuno,Lingleville,104.33,145.15,95.25,151.95,392.36,Single-ply,SBD,M,
Boys,109.77,4,Adian Gill,Perrin-Whitt,104.24,111.13,68.04,138.35,317.51,Single-ply,SBD,M,
Boys,109.77,DQ,Payton Brister,Jonesboro,103.51,102.06,,181.44,,Single-ply,SBD,M,
Boys,124.74,1,Samuel Kinder,Perrin-Whitt,113.31,192.78,106.59,204.12,503.49,Single-ply,SBD,M,
Boys,124.74,2,Adam Crawford,Perrin-Whitt,119.48,167.83,113.4,154.22,435.45,Single-ply,SBD,M,
Boys,124.74,3,Mason Bradley,Lingleville,118.39,92.99,63.5,122.47,278.96,Single-ply,SBD,M,
Boys,139.71+,1,Gage Balthrop,Roscoe Highland,152.86,204.12,102.06,199.58,505.76,Single-ply,SBD,M,
Boys,139.71+,2,Piercyn Brooks,Perrin-Whitt,140.07,158.76,95.25,165.56,419.57,Single-ply,SBD,M,
