Division,WeightClassKg,Place,Name,Team,BodyweightKg,Best3SquatKg,Best3BenchKg,Best3DeadliftKg,TotalKg,Equipment,Event,Sex,BirthDate
Boys,51.71,1,Jose Chapa,Ben Bolt-Palito Blanco,51.62,147.42,77.11,147.42,371.95,Unlimited,SBD,M,
Boys,51.71,2,Martin Torres,Freer,51.71,111.13,70.31,136.08,317.51,Unlimited,SBD,M,
Boys,51.71,3,Von Barrera,Odem,48.63,106.59,61.23,97.52,265.35,Unlimited,SBD,M,
Boys,55.79,1,Benjamin Molina,Alice,53.52,106.59,54.43,124.74,285.76,Unlimited,SBD,M,
Boys,59.87,1,Austin Molina,Odem,58.42,197.31,92.99,226.8,517.1,Unlimited,SBD,M,
Boys,59.87,2,Caden Chavez,Mathis,58.97,181.44,104.33,179.17,464.93,Unlimited,SBD,M,
Boys,59.87,3,Kim Yates,George West,59.87,142.88,83.91,142.88,369.68,Unlimited,SBD,M,
Boys,59.87,4,Brennan Keese,Skidmore-Tynan,58.06,129.27,54.43,122.47,306.17,Unlimited,SBD,M,
Boys,59.87,DQ,John Aguilar,Ben Bolt-Palito Blanco,57.33,92.99,,,,Unlimited,SBD,M,
Boys,67.13,1,Pj Brown,Alice,65.86,215.46,156.49,226.8,598.74,Unlimited,SBD,M,
Boys,67.13,2,Evan Bernal,Ben Bolt-Palito Blanco,67.04,204.12,122.47,190.51,517.1,Unlimited,SBD,M,
Boys,67.13,3,Joshua Arroyos,Beeville Jones,66.86,192.78,102.06,215.46,510.29,Unlimited,SBD,M,
Boys,67.13,4,Antonio Pena,Ingleside,66.04,190.51,120.2,190.51,501.22,Unlimited,SBD,M,
Boys,67.13,5,Ricky Ayala,Stockdale,67.13,156.49,111.13,188.24,455.86,Unlimited,SBD,M,
Boys,67.13,6,Davy Rodriguez,Mathis,63.05,161.03,122.47,170.1,453.59,Unlimited,SBD,M,
Boys,67.13,7,Melisio Garcia,Pettus,65.23,156.49,88.45,183.7,428.64,Unlimited,SBD,M,
Boys,67.13,8,Carson Lopez,Ingleside,63.23,149.69,83.91,142.88,376.48,Unlimited,SBD,M,
Boys,67.13,9,Isaac Romero,Odem,62.14,142.88,83.91,145.15,371.95,Unlimited,SBD,M,
Boys,67.13,10,John Albert Cisneros,George West,63.5,120.2,88.45,147.42,356.07,Unlimited,SBD,M,
Boys,67.13,11,Bryce Rey,Pettus,61.51,131.54,79.38,142.88,353.8,Unlimited,SBD,M,
Boys,67.13,12,Ryan Salinas,Odem,61.23,113.4,79.38,102.06,294.84,Unlimited,SBD,M,
Boys,67.13,13,Ryan Vasquez,George West,64.41,83.91,83.91,102.06,269.89,Unlimited,SBD,M,
Boys,67.13,DQ,J-Den Martinez,Mathis,62.14,,,,,Unlimited,SBD,M,
Boys,74.84,1,Aaron Acosta,Mathis,73.3,226.8,149.69,238.14,614.62,Unlimited,SBD,M,
Boys,74.84,2,Nik Garza,Alice,71.94,235.87,147.42,229.06,612.35,Unlimited,SBD,M,
Boys,74.84,3,Itzac Cruz,Odem,72.85,195.04,149.69,219.99,564.72,Unlimited,SBD,M,
Boys,74.84,4,Felipe Rodriguez,Alice,72.03,206.38,136.08,195.04,537.51,Unlimited,SBD,M,
Boys,74.84,5,Roel Gonzalez,Alice,69.58,192.78,115.67,206.38,514.83,Unlimited,SBD,M,
Boys,74.84,6,Aiden Martinez,Odem,72.12,183.7,115.67,192.78,492.15,Unlimited,SBD,M,
Boys,74.84,7,Jayden Hernandez,Alice,72.21,192.78,117.93,179.17,489.88,Unlimited,SBD,M,
Boys,74.84,8,Alex Gonzalez,Freer,67.59,170.1,111.13,172.37,453.59,Unlimited,SBD,M,
Boys,74.84,9,Anthonie Cordova,Ingleside,71.49,167.83,99.79,183.7,451.32,Unlimited,SBD,M,
Boys,74.84,10,Anthony Munoz,Poteet,68.95,156.49,106.59,158.76,421.84,Unlimited,SBD,M,
Boys,74.84,11,Cj Rucker,Stockdale,67.49,161.03,88.45,156.49,405.97,Unlimited,SBD,M,
Boys,74.84,12,Marcus Barron,Ingleside,69.13,142.88,90.72,142.88,376.48,Unlimited,SBD,M,
Boys,74.84,13,Christovin Cisneros,George West,73.94,129.27,68.04,115.67,312.98,Unlimited,SBD,M,
Boys,74.84,DQ,Matthew Hernandez,Pettus,71.67,156.49,,,,Unlimited,SBD,M,
Boys,74.84,DQ,Duke Bernal,Mathis,72.57,192.78,147.42,,,Unlimited,SBD,M,
Boys,82.1,1,Ryne Espinoza,Beeville Jones,81.74,283.5,172.37,238.14,694,Unlimited,SBD,M,
Boys,82.1,2,Armando DeLeon,Alice,81.74,213.19,145.15,217.72,576.06,Unlimited,SBD,M,
Boys,82.1,3,Davian Zuniga,George West,80.74,192.78,124.74,167.83,485.34,Unlimited,SBD,M,
Boys,82.1,4,Juan Franco,Stockdale,80.92,204.12,124.74,151.95,480.81,Unlimited,SBD,M,
Boys,82.1,5,Ray Espinoza,Beeville Jones,77.29,172.37,124.74,163.29,460.4,Unlimited,SBD,M,
Boys,82.1,6,Alex Castellano,George West,79.83,165.56,113.4,167.83,446.79,Unlimited,SBD,M,
Boys,82.1,DQ,Isaac Rivas,Mathis,80.29,158.76,,,,Unlimited,SBD,M,
Boys,89.81,1,Damion Trevino,Mathis,85.18,226.8,154.22,229.06,610.08,Unlimited,SBD,M,
Boys,89.81,2,Seth Dunn,Poteet,89.36,224.53,142.88,206.38,573.79,Unlimited,SBD,M,
Boys,89.81,3,Jason Ramirez,Odem,86,210.92,138.35,213.19,562.45,Unlimited,SBD,M,
Boys,89.81,4,Carlos Laredo,Beeville Jones,86.91,195.04,111.13,192.78,498.95,Unlimited,SBD,M,
Boys,89.81,5,Marcus Perez,Alice,88.36,170.1,129.27,190.51,489.88,Unlimited,SBD,M,
Boys,89.81,6,Dominic Smith,Beeville Jones,87.09,172.37,117.93,172.37,462.66,Unlimited,SBD,M,
Boys,89.81,7,Mauricio Parra,Ben Bolt-Palito Blanco,86.64,172.37,108.86,149.69,430.91,Unlimited,SBD,M,
Boys,89.81,8,Emilio Martinez,Ingleside,83.55,154.22,99.79,167.83,421.84,Unlimited,SBD,M,
Boys,89.81,9,Nathaniel Skau,Pettus,85.18,133.81,92.99,145.15,371.95,Unlimited,SBD,M,
Boys,89.81,10,Ethan Engler,Stockdale,88.81,138.35,88.45,145.15,371.95,Unlimited,SBD,M,
Boys,89.81,11,Sean Roberts,Skidmore-Tynan,84.91,90.72,63.5,90.72,244.94,Unlimited,SBD,M,
Boys,99.79,1,Ram Cantu,Alice,98.34,251.74,174.63,219.99,646.37,Unlimited,SBD,M,
Boys,99.79,2,Jacob Martin,Beeville Jones,97.98,247.21,174.63,217.72,639.57,Unlimited,SBD,M,
Boys,99.79,3,Xavier Hernandez,Stockdale,94.35,244.94,133.81,249.48,628.23,Unlimited,SBD,M,
Boys,99.79,4,Alec Arguijo,Poteet,91.44,231.33,117.93,238.14,587.4,Unlimited,SBD,M,
Boys,99.79,5,Eduardo Medina,Odem,99.79,244.94,142.88,197.31,585.13,Unlimited,SBD,M,
Boys,99.79,6,Jallen Medina,George West,96.16,233.6,142.88,204.12,580.6,Unlimited,SBD,M,
Boys,99.79,7,Gilbert Deleon,Ben Bolt-Palito Blanco,93.44,188.24,104.33,158.76,451.32,Unlimited,SBD,M,
Boys,99.79,8,Jim Aguillon,Freer,98.88,172.37,104.33,149.69,426.38,Unlimited,SBD,M,
Boys,99.79,9,John Baca,Stockdale,90.54,172.37,95.25,154.22,421.84,Unlimited,SBD,M,
Boys,99.79,10,Jonah Uribe,Freer,92.26,151.95,104.33,158.76,415.04,Unlimited,SBD,M,
Boys,99.79,11,Josh Nunez,Odem,90.9,124.74,79.38,136.08,340.19,Unlimited,SBD,M,
Boys,109.77,1,Cameron Garcia,Three Rivers,102.97,199.58,145.15,190.51,535.24,Unlimited,SBD,M,
Boys,109.77,2,Ethan Sanchez,Beeville Jones,103.06,226.8,113.4,190.51,530.7,Unlimited,SBD,M,
Boys,109.77,3,Ruben Contreras,Freer,101.88,210.92,115.67,174.63,501.22,Unlimited,SBD,M,
Boys,109.77,4,Conner Hajovsky,Stockdale,104.33,165.56,102.06,158.76,426.38,Unlimited,SBD,M,
Boys,109.77,5,Richard Lurch,Beeville Jones,105.87,158.76,111.13,147.42,417.3,Unlimited,SBD,M,
Boys,109.77,6,Gilbert Pena,Odem,104.14,108.86,122.47,102.06,333.39,Unlimited,SBD,M,
Boys,109.77,DQ,Cayetano Vidaurri,Beeville Jones,107.86,317.51,192.78,,,Unlimited,SBD,M,
Boys,109.77,DQ,Lucas Stillman,Ingleside,104.69,,,,,Unlimited,SBD,M,
Boys,124.74,1,Arnulfo Puga,Beeville Jones,123.38,294.84,170.1,215.46,680.39,Unlimited,SBD,M,
Boys,124.74,2,Christopher Goodman,Ben Bolt-Palito Blanco,119.75,258.55,161.03,201.85,621.42,Unlimited,SBD,M,
Boys,124.74,3,Alex Botello,Alice,120.38,258.55,136.08,226.8,621.42,Unlimited,SBD,M,
Boys,124.74,4,Manuel Hinojosa,Ingleside,121.29,263.08,129.27,226.8,619.15,Unlimited,SBD,M,
Boys,124.74,5,Logan McGarth,Ingleside,115.21,235.87,142.88,208.65,587.4,Unlimited,SBD,M,
Boys,124.74,6,Andrew Morin,Three Rivers,117.84,183.7,124.74,172.37,480.81,Unlimited,SBD,M,
Boys,124.74,7,Milton Garcia,Odem,121.11,192.78,115.67,165.56,474,Unlimited,SBD,M,
Boys,124.74,8,Mikey Carranza,Mathis,122.92,183.7,127.01,151.95,462.66,Unlimited,SBD,M,
Boys,124.74,9,Gavyn Gonzales,Freer,122.47,163.29,86.18,192.78,442.25,Unlimited,SBD,M,
Boys,124.74,10,David Ortiz,Freer,112.94,115.67,81.65,131.54,328.85,Unlimited,SBD,M,
Boys,124.74,11,Marcelo Armenta,Beeville Jones,116.94,102.06,99.79,102.06,303.91,Unlimited,SBD,M,
Boys,139.71,1,Javier Perez,Freer,135.44,299.37,167.83,224.53,691.73,Unlimited,SBD,M,
Boys,139.71,2,Eli Juarez,Freer,133.45,278.96,179.17,204.12,662.24,Unlimited,SBD,M,
Boys,139.71,3,Wyatt Smith,George West,130.18,210.92,124.74,174.63,510.29,Unlimited,SBD,M,
Boys,139.71,4,Esai Escobar,Alice,130,154.22,95.25,170.1,419.57,Unlimited,SBD,M,
Boys,139.71+,1,Peyton Torres,Beeville Jones,151.05,244.94,185.97,215.46,646.37,Unlimited,SBD,M,
Boys,139.71+,2,Dalton Romo,Three Rivers,186.88,115.67,90.72,151.95,358.34,Unlimited,SBD,M,
