Division,WeightClassKg,Place,Name,Team,BodyweightKg,Best3SquatKg,Best3BenchKg,Best3DeadliftKg,TotalKg,Equipment,Event,Sex,BirthDate
Girls,44.23,1,Mylei Donahue,Kyle Lehman,43.64,129.27,56.7,106.59,292.57,Unlimited,SBD,F,
Girls,44.23,2,Deysi Villegas,Granbury,43.05,99.79,45.36,113.4,258.55,Unlimited,SBD,F,
Girls,44.23,3,Esmeralda Villa-Corrales,Waco,43.27,88.45,49.9,92.99,231.33,Unlimited,SBD,F,
Girls,44.23,4,Makayla Ortega,Cleburne,43.64,83.91,36.29,83.91,204.12,Unlimited,SBD,F,
Girls,44.23,5,Mia Cisneros,Cleburne,43,63.5,36.29,83.91,183.7,Unlimited,SBD,F,
Girls,44.23,6,Jessica Aguado,Granbury,42.73,70.31,45.36,65.77,181.44,Unlimited,SBD,F,
Girls,44.23,7,Kaitlyn Maus,Lake Belton,43.36,72.57,34.02,74.84,181.44,Unlimited,SBD,F,
Girls,44.23,8,Kailee Welsh,Georgetown,41.87,61.23,36.29,58.97,156.49,Unlimited,SBD,F,
Girls,44.23,DQ,Taylor Marines,Pflugerville Hendrickson,38.56,,,,,Unlimited,SBD,F,
Girls,44.23,DQ,Addison Davis,Cleburne,43.09,90.72,,,,Unlimited,SBD,F,
Girls,47.85,1,Kaya Shellhammer,Buda Hays,47.26,142.88,49.9,136.08,328.85,Unlimited,SBD,F,
Girls,47.85,2,Beth Stracener,College Station,47.49,122.47,61.23,108.86,292.57,Unlimited,SBD,F,
Girls,47.85,3,Amaya Stafford,Killeen,45.9,97.52,61.23,122.47,281.23,Unlimited,SBD,F,
Girls,47.85,4,Emma Scholz,Lake Belton,46.22,95.25,65.77,99.79,260.82,Unlimited,SBD,F,
Girls,47.85,5,Macie Solis,Lake Belton,46.99,97.52,54.43,106.59,258.55,Unlimited,SBD,F,
Girls,47.85,6,Kensey Kalstad,Pflugerville Hendrickson,47.72,97.52,58.97,99.79,256.28,Unlimited,SBD,F,
Girls,47.85,7,Vivi Valenzuela,Kyle Lehman,46.99,92.99,52.16,97.52,242.67,Unlimited,SBD,F,
Girls,47.85,8,Alyssa Arroyo,Burleson Centennial,46.81,77.11,49.9,86.18,213.19,Unlimited,SBD,F,
Girls,47.85,9,Jazmynn Torres,Granbury,46.63,90.72,36.29,83.91,210.92,Unlimited,SBD,F,
Girls,47.85,10,Alexis Chavez,Burleson Centennial,47.08,90.72,45.36,70.31,206.38,Unlimited,SBD,F,
Girls,47.85,11,Shezyd Garibay,Burleson Centennial,47.81,70.31,43.09,83.91,197.31,Unlimited,SBD,F,
Girls,47.85,12,Angelica Perez,Granbury,45.68,74.84,38.56,74.84,188.24,Unlimited,SBD,F,
Girls,51.94,1,Lola Williams,Kyle Lehman,51.17,156.49,70.31,122.47,349.27,Unlimited,SBD,F,
Girls,51.94,2,Peyton Kirkpatrick,Burleson Centennial,51.17,111.13,63.5,122.47,297.1,Unlimited,SBD,F,
Girls,51.94,3,Laura Rife,College Station,50.67,117.93,54.43,106.59,278.96,Unlimited,SBD,F,
Girls,51.94,4,Marie Donahue,Kyle Lehman,50.35,106.59,49.9,120.2,276.69,Unlimited,SBD,F,
Girls,51.94,5,Sha'Nija Smith,Waco,49.53,95.25,58.97,120.2,274.42,Unlimited,SBD,F,
Girls,51.94,6,Lexie Mendez,Burleson Centennial,49.67,108.86,52.16,108.86,269.89,Unlimited,SBD,F,
Girls,51.94,7,Moriah Rydberg,Lake Belton,49.17,104.33,58.97,99.79,263.08,Unlimited,SBD,F,
Girls,51.94,8,Janet Whittle,College Station A&M Cons,51.07,111.13,56.7,95.25,263.08,Unlimited,SBD,F,
Girls,51.94,9,Shekayla Munoz,Lake Belton,49.9,88.45,61.23,106.59,256.28,Unlimited,SBD,F,
Girls,51.94,10,Emma Elizondo,Pflugerville Hendrickson,51.07,92.99,45.36,104.33,242.67,Unlimited,SBD,F,
Girls,51.94,11,Ayah Carrias,College Station A&M Cons,50.67,88.45,47.63,90.72,226.8,Unlimited,SBD,F,
Girls,51.94,12,Jetta Roye,Cleburne,49.44,68.04,47.63,88.45,204.12,Unlimited,SBD,F,
Girls,51.94,DQ,Taylor Love,Lake Belton,50.85,,,,,Unlimited,SBD,F,
Girls,56.02,1,Alexia Smith,Buda Hays,55.16,127.01,63.5,147.42,337.93,Unlimited,SBD,F,
Girls,56.02,2,Danica Linkowski,Burleson Centennial,55.16,133.81,77.11,122.47,333.39,Unlimited,SBD,F,
Girls,56.02,3,Madeline Lowe,Burleson Centennial,54.66,122.47,86.18,122.47,331.12,Unlimited,SBD,F,
Girls,56.02,4,Emily Bachicha,Lake Belton,54.11,122.47,63.5,136.08,322.05,Unlimited,SBD,F,
Girls,56.02,5,Hailey Ruiz,Buda Hays,54.7,129.27,58.97,124.74,312.98,Unlimited,SBD,F,
Girls,56.02,6,Mirabella Dietz,Buda Hays,53.16,120.2,52.16,131.54,303.91,Unlimited,SBD,F,
Girls,56.02,7,Sha'Niya Smith,Waco,54.61,117.93,56.7,127.01,301.64,Unlimited,SBD,F,
Girls,56.02,8,Scarlytt Cotham,Lake Belton,53.8,108.86,65.77,122.47,297.1,Unlimited,SBD,F,
Girls,56.02,9,Camden Lechler,College Station,55.11,117.93,56.7,120.2,294.84,Unlimited,SBD,F,
Girls,56.02,10,Ruth Kearley,Buda Hays,54.7,108.86,61.23,122.47,292.57,Unlimited,SBD,F,
Girls,56.02,11,Lauren Reece,Burleson Centennial,52.71,102.06,56.7,111.13,269.89,Unlimited,SBD,F,
Girls,56.02,DQ,Abigail Pennington,Burleson Centennial,53.98,113.4,,,,Unlimited,SBD,F,
Girls,60.1,1,Leila Gomez,Kyle Lehman,59.78,185.97,81.65,149.69,417.3,Unlimited,SBD,F,
Girls,60.1,2,Keileigh Bowie,College Station,59.78,176.9,99.79,124.74,401.43,Unlimited,SBD,F,
Girls,60.1,3,Natalia Juarez,Waco,59.28,138.35,77.11,120.2,335.66,Unlimited,SBD,F,
Girls,60.1,4,Alexis Conaway,Burleson Centennial,58.24,115.67,92.99,113.4,322.05,Unlimited,SBD,F,
Girls,60.1,5,Sarahi Xic Ajpacaja,College Station A&M Cons,57.06,131.54,63.5,124.74,319.78,Unlimited,SBD,F,
Girls,60.1,6,Harper Watkins,College Station,58.51,122.47,61.23,122.47,306.17,Unlimited,SBD,F,
Girls,60.1,7,Payton Ely,Buda Hays,58.56,120.2,61.23,113.4,294.84,Unlimited,SBD,F,
Girls,60.1,8,Kasey Rice,Georgetown East View,59.33,120.2,56.7,113.4,290.3,Unlimited,SBD,F,
Girls,60.1,9,Olivia Sedlacek,Burleson Centennial,59.06,113.4,65.77,108.86,288.03,Unlimited,SBD,F,
Girls,60.1,10,Leia Lopez,College Station,56.11,113.4,54.43,115.67,283.5,Unlimited,SBD,F,
Girls,60.1,11,Andrea Villanueva,Pflugerville Hendrickson,58.6,113.4,49.9,108.86,272.16,Unlimited,SBD,F,
Girls,60.1,DQ,Kambree Burns,College Station A&M Cons,57.52,,,,,Unlimited,SBD,F,
Girls,60.1,DQ,Angelyn Falcon,Pflugerville Hendrickson,58.97,,,,,Unlimited,SBD,F,
Girls,67.36,1,Ryan Doggett,Pflugerville Hendrickson,65.59,174.63,117.93,149.69,442.25,Unlimited,SBD,F,
Girls,67.36,2,Aaliyah Respress,Kyle Lehman,64.55,181.44,90.72,145.15,417.3,Unlimited,SBD,F,
Girls,67.36,3,Giovanna Castellani,College Station,65.54,174.63,77.11,142.88,394.63,Unlimited,SBD,F,
Girls,67.36,4,Jocelyne Jaimes,Kyle Lehman,66.36,179.17,70.31,129.27,378.75,Unlimited,SBD,F,
Girls,67.36,5,Madyson Updyke,Lake Belton,66.45,149.69,65.77,151.95,367.41,Unlimited,SBD,F,
Girls,67.36,6,Lily Ramirez,Kyle Lehman,65.59,165.56,72.57,124.74,362.87,Unlimited,SBD,F,
Girls,67.36,7,Madison Barber,College Station,66.5,142.88,74.84,145.15,362.87,Unlimited,SBD,F,
Girls,67.36,8,Yinnie Cosme,Killeen Ellison,66.32,140.61,72.57,142.88,356.07,Unlimited,SBD,F,
Girls,67.36,9,Coryn French,Burleson Centennial,66.86,138.35,81.65,124.74,344.73,Unlimited,SBD,F,
Girls,67.36,10,Jennifer Martinez-Olvera,Waco,65.23,147.42,52.16,136.08,335.66,Unlimited,SBD,F,
Girls,67.36,DQ,Grace Halford,Burleson Centennial,66.45,,,,,Unlimited,SBD,F,
Girls,67.36,DQ,Nadia Mustafic,Burleson Centennial,65.77,151.95,,,,Unlimited,SBD,F,
Girls,75.07,1,Jessica Kolodziejczyk,College Station,69.26,201.85,79.38,136.08,417.3,Unlimited,SBD,F,
Girls,75.07,2,Holley Matthews,Pflugerville Hendrickson,72.67,156.49,77.11,183.7,417.3,Unlimited,SBD,F,
Girls,75.07,3,Tehani Akina,Killeen Shoemaker,70.22,149.69,90.72,158.76,399.16,Unlimited,SBD,F,
Girls,75.07,4,Victoria Shimabukuro,Lake Belton,71.85,165.56,81.65,149.69,396.89,Unlimited,SBD,F,
Girls,75.07,5,Kyia Miller,Kyle Lehman,67.49,161.03,83.91,149.69,394.63,Unlimited,SBD,F,
Girls,75.07,6,Avery Berger,Georgetown,70.22,140.61,97.52,154.22,392.36,Unlimited,SBD,F,
Girls,75.07,7,Faith Coleman,Burleson Centennial,74.39,158.76,83.91,147.42,390.09,Unlimited,SBD,F,
Girls,75.07,8,Da Rihanna Roberts,College Station A&M Cons,70.31,145.15,86.18,147.42,378.75,Unlimited,SBD,F,
Girls,75.07,9,Colleen Gulde,College Station,69.81,161.03,77.11,136.08,374.21,Unlimited,SBD,F,
Girls,75.07,10,Ashley Harris,College Station,70.76,158.76,70.31,145.15,374.21,Unlimited,SBD,F,
Girls,75.07,11,Riley Kinser,Georgetown East View,72.57,151.95,81.65,140.61,374.21,Unlimited,SBD,F,
Girls,75.07,12,Rai Pack,College Station A&M Cons,70.08,142.88,83.91,120.2,347,Unlimited,SBD,F,
Girls,75.07,13,Maddie Caldwell,Burleson Centennial,72.48,120.2,83.91,129.27,333.39,Unlimited,SBD,F,
Girls,82.33,1,Estrella Diaz,Granbury,79.92,179.17,92.99,158.76,430.91,Unlimited,SBD,F,
Girls,82.33,2,Olivia Montoya,Kyle Lehman,75.34,172.37,95.25,145.15,412.77,Unlimited,SBD,F,
Girls,82.33,3,Alexia Scott-Padmore,Killeen Shoemaker,79.92,145.15,88.45,167.83,401.43,Unlimited,SBD,F,
Girls,82.33,4,Jordyn January,Pflugerville Hendrickson,81.28,149.69,79.38,156.49,385.55,Unlimited,SBD,F,
Girls,82.33,5,Aleyna Castor,Lake Belton,75.11,133.81,70.31,142.88,347,Unlimited,SBD,F,
Girls,82.33,6,Sarah Wilbourn,Cleburne,80.74,136.08,61.23,142.88,340.19,Unlimited,SBD,F,
Girls,82.33,7,Litzy Camacho,Georgetown,77.29,138.35,61.23,131.54,331.12,Unlimited,SBD,F,
Girls,82.33,8,Arianna Galindo,Burleson Centennial,77.29,133.81,72.57,117.93,324.32,Unlimited,SBD,F,
Girls,82.33,9,Mia Ndika,Pflugerville Hendrickson,78.38,120.2,65.77,136.08,322.05,Unlimited,SBD,F,
Girls,82.33,10,Karmyn Williams,Granbury,78.83,133.81,56.7,115.67,306.17,Unlimited,SBD,F,
Girls,82.33,11,Kynleigh Hawkins,Cleburne,79.2,133.81,65.77,97.52,297.1,Unlimited,SBD,F,
Girls,82.33,DQ,Araceli Sanchez,Georgetown East View,75.48,,,,,Unlimited,SBD,F,
Girls,82.33,DQ,Jayla Valenzuela,Cleburne,78.65,147.42,70.31,,,Unlimited,SBD,F,
Girls,90.04,1,Jaya Lisenbe,Lake Belton,86.73,161.03,81.65,161.03,403.7,Unlimited,SBD,F,
Girls,90.04,2,Mercedes Torres,Cleburne,88.81,167.83,81.65,149.69,399.16,Unlimited,SBD,F,
Girls,90.04,3,Aniya Taylor,College Station,83.91,167.83,86.18,142.88,396.89,Unlimited,SBD,F,
Girls,90.04,4,Kiarha Arellano,Cleburne,90.04,167.83,97.52,131.54,396.89,Unlimited,SBD,F,
Girls,90.04,5,Elena Guevara,Kyle Lehman,86.27,145.15,83.91,142.88,371.95,Unlimited,SBD,F,
Girls,90.04,6,Mavise Bordo,Georgetown East View,87.63,133.81,56.7,151.95,342.46,Unlimited,SBD,F,
Girls,90.04,7,Caliee Holland,Georgetown,84.69,124.74,70.31,129.27,324.32,Unlimited,SBD,F,
Girls,90.04,8,Rashey Delesline,Waco,87.09,129.27,56.7,127.01,312.98,Unlimited,SBD,F,
Girls,90.04,9,Jasmina Iljazi,Burleson Centennial,83.32,111.13,63.5,117.93,292.57,Unlimited,SBD,F,
Girls,90.04,DQ,Harmony Burns,Granbury,88.54,122.47,70.31,,,Unlimited,SBD,F,
Girls,90.04,DQ,Isabella Caro,Burleson Centennial,83.19,,,,,Unlimited,SBD,F,
Girls,90.04,DQ,Isabella Fisher,Cleburne,83.19,90.72,52.16,,,Unlimited,SBD,F,
Girls,100.02,1,Crystal Martinez,Kyle Lehman,98.25,233.6,138.35,204.12,576.06,Unlimited,SBD,F,
Girls,100.02,2,Bella Garcia,Granbury,95.84,158.76,79.38,136.08,374.21,Unlimited,SBD,F,
Girls,100.02,3,Marisol Sanchez,Georgetown East View,95.62,145.15,72.57,151.95,369.68,Unlimited,SBD,F,
Girls,100.02,4,Michelle Lamar,Lake Belton,94.26,129.27,68.04,129.27,326.59,Unlimited,SBD,F,
Girls,100.02,5,Danielle Esquivel,Lake Belton,96.07,120.2,68.04,117.93,306.17,Unlimited,SBD,F,
Girls,100.02,6,Elizabeth Rutherford,Lake Belton,90.4,113.4,68.04,113.4,294.84,Unlimited,SBD,F,
Girls,100.02,7,Paisley Gaither-Lybrand,Burleson Centennial,94.12,108.86,54.43,117.93,281.23,Unlimited,SBD,F,
Girls,100.02,8,Yesenia Viveros,Killeen,93.08,111.13,52.16,111.13,274.42,Unlimited,SBD,F,
Girls,100.02,9,Kolbi Evans #2,Burleson Centennial,94.08,90.72,49.9,102.06,242.67,Unlimited,SBD,F,
Girls,100.02,DQ,Jayla Craft,College Station A&M Cons,96.48,167.83,86.18,,,Unlimited,SBD,F,
Girls,100.02,DQ,Savannah Alvarado,College Station A&M Cons,92.44,129.27,65.77,,,Unlimited,SBD,F,
Girls,100.02,DQ,Bethany West,College Station A&M Cons,93.62,145.15,,,,Unlimited,SBD,F,
Girls,110,1,J Miracle Sandle,College Station,100.52,163.29,95.25,129.27,387.82,Unlimited,SBD,F,
Girls,110,2,Kathryn Goodner,Granbury,100.11,124.74,92.99,138.35,356.07,Unlimited,SBD,F,
Girls,110,3,Rosita Madrid,Cleburne,108.5,142.88,61.23,113.4,317.51,Unlimited,SBD,F,
Girls,110,4,Allie Uzzell,Lake Belton,100.43,138.35,68.04,102.06,308.44,Unlimited,SBD,F,
Girls,110,5,Kyra Moseley,Killeen Ellison,104.96,127.01,65.77,111.13,303.91,Unlimited,SBD,F,
Girls,110,6,Olivia Morrison,Georgetown,102.87,95.25,54.43,115.67,265.35,Unlimited,SBD,F,
Girls,110,7,Olivia Byers,Killeen,109.04,58.97,61.23,86.18,206.38,Unlimited,SBD,F,
Girls,110,8,Tori Seifert,Killeen Shoemaker,104.24,68.04,36.29,81.65,185.97,Unlimited,SBD,F,
Girls,110,DQ,Parker Goldflam,Killeen Shoemaker,107.68,,,,,Unlimited,SBD,F,
Girls,110,DQ,Kirsten Bonds,College Station A&M Cons,108.23,113.4,,,,Unlimited,SBD,F,
Girls,110,DQ,Madison Crawford,Granbury,107.18,,,,,Unlimited,SBD,F,
Girls,110+,1,Breanna Ihrig,College Station,117.39,167.83,86.18,154.22,408.23,Unlimited,SBD,F,
Girls,110+,2,Sarah Dix,Waco,115.35,142.88,83.91,145.15,371.95,Unlimited,SBD,F,
Girls,110+,3,Meleana Price,Killeen,124.56,154.22,74.84,142.88,371.95,Unlimited,SBD,F,
Girls,110+,4,Esmeralda Vidales,Cleburne,110.9,136.08,74.84,133.81,344.73,Unlimited,SBD,F,
Girls,110+,5,Destiney Ward,Waco,128.96,142.88,68.04,124.74,335.66,Unlimited,SBD,F,
Girls,110+,6,Isabella Juarez,Cleburne,132.49,102.06,65.77,74.84,242.67,Unlimited,SBD,F,
Girls,110+,DQ,Terriny Pace,Killeen,154.49,219.99,102.06,,,Unlimited,SBD,F,
Girls,110+,DQ,Courtney Green,College Station A&M Cons,152.27,111.13,68.04,,,Unlimited,SBD,F,
Girls,110+,DQ,Serenity Foster,College Station A&M Cons,111.95,129.27,,,,Unlimited,SBD,F,
Girls,110+,DQ,Lillyann Walden,Lake Belton,134.35,133.81,,,,Unlimited,SBD,F,
