{
  "source_url" : "https://www.healthwebmagazine.com/memory-supplements/alpha-gpc-reviews/",
  "raw_html_file_name" : "memory-supplementsalpha-gpc-reviews",
  "keywords" : "alpha gpc reviews  does it really work and worth the money"
}