<svg width="36" height="36" viewBox="0 0 36 36" fill="none" xmlns="http://www.w3.org/2000/svg">
<path d="M16.8574 0.383965C17.3076 0.132193 17.8149 0 18.3307 0C18.8466 0 19.3538 0.132193 19.8041 0.383965L33.2665 7.98907C33.6882 8.22922 34.0396 8.57591 34.2854 8.99446C34.5311 9.41301 34.6627 9.88876 34.6669 10.3741V25.6293C34.6586 26.1334 34.5144 26.6259 34.2496 27.0549C33.9847 27.4838 33.609 27.8334 33.162 28.0666L19.7483 35.6339C19.2896 35.8874 18.7713 36.0134 18.2474 35.9989C17.7235 35.9843 17.2131 35.8297 16.7692 35.5511L12.7444 33.2254C12.4497 33.0938 12.1851 32.9033 11.9667 32.6656C12.1377 32.4352 12.4437 32.4064 12.6922 32.3056C13.2439 32.1085 13.776 31.8602 14.2816 31.564C14.3452 31.5265 14.4187 31.5088 14.4924 31.5133C14.5662 31.5178 14.6369 31.5442 14.6956 31.5892C15.8404 32.2462 16.9762 32.923 18.1282 33.5746C18.373 33.7168 18.6214 33.5278 18.8302 33.4126C23.2199 30.931 27.6102 28.453 32.001 25.9785C32.0794 25.9394 32.1441 25.8777 32.1868 25.8013C32.2295 25.7248 32.2482 25.6373 32.2404 25.5501C32.244 20.5185 32.2446 15.4862 32.2422 10.4533C32.2501 10.3555 32.2273 10.2577 32.177 10.1735C32.1266 10.0893 32.0513 10.0229 31.9614 9.9835C27.5046 7.47307 23.0489 4.96143 18.5944 2.44859C18.5171 2.3955 18.4255 2.36708 18.3316 2.36708C18.2378 2.36708 18.1462 2.3955 18.0688 2.44859C13.6132 4.95903 9.1587 7.47127 4.70544 9.9853C4.61506 10.0236 4.53908 10.0895 4.48834 10.1735C4.43759 10.2576 4.41467 10.3555 4.42283 10.4533V25.5501C4.41524 25.637 4.43446 25.7242 4.47791 25.7998C4.52136 25.8754 4.58695 25.9359 4.66584 25.9731C5.85386 26.6475 7.04367 27.3196 8.23529 27.9892C8.56537 28.1932 8.93479 28.3253 9.31941 28.3768C9.70404 28.4283 10.0952 28.398 10.4673 28.288C10.7903 28.1664 11.0685 27.9491 11.2644 27.665C11.4603 27.3809 11.5647 27.0437 11.5635 26.6985C11.5689 21.6945 11.5599 16.6904 11.5671 11.6899C11.5659 11.6368 11.5759 11.5841 11.5965 11.5351C11.617 11.4861 11.6476 11.4421 11.6863 11.4057C11.7251 11.3694 11.771 11.3416 11.8212 11.3242C11.8714 11.3068 11.9246 11.3002 11.9775 11.3047C12.55 11.3011 13.1206 11.2975 13.693 11.3065C13.7486 11.3091 13.803 11.3234 13.8527 11.3485C13.9024 11.3735 13.9462 11.4088 13.9814 11.4519C14.0165 11.4951 14.0422 11.5451 14.0567 11.5988C14.0712 11.6526 14.0742 11.7088 14.0656 11.7637C14.0638 16.7984 14.071 21.8331 14.062 26.8659C14.1004 27.5501 13.9544 28.2321 13.6394 28.8406C13.3244 29.4491 12.8518 29.962 12.2709 30.3256C11.4953 30.687 10.6462 30.8629 9.79079 30.8395C8.9354 30.816 8.09719 30.5939 7.34248 30.1906C6.03386 29.5372 4.78644 28.7686 3.50302 28.0666C3.05603 27.8336 2.68035 27.4841 2.41576 27.055C2.15117 26.626 2.00751 26.1333 2 25.6293V10.3741C2.00384 9.87898 2.14005 9.39389 2.39453 8.96914C2.649 8.54438 3.01246 8.19544 3.44722 7.95847C7.91848 5.43484 12.3891 2.91 16.8592 0.383965H16.8574Z" fill="#C6CBD2"/>
<path d="M20.7581 10.9502C22.734 10.6949 24.7418 11.0025 26.5506 11.8376C27.2061 12.2286 27.7481 12.7841 28.1228 13.449C28.4976 14.1139 28.6922 14.8652 28.6873 15.6284C28.6619 15.7239 28.603 15.807 28.5214 15.8626C28.4397 15.9181 28.3407 15.9424 28.2426 15.9308C27.6756 15.9308 27.1104 15.938 26.5452 15.9272C26.4361 15.9205 26.3334 15.8732 26.2575 15.7946C26.1815 15.7159 26.1378 15.6117 26.1348 15.5024C26.0706 15.1329 25.9267 14.7818 25.7132 14.4734C25.4996 14.1651 25.2215 13.9069 24.8982 13.7168C23.8221 13.2891 22.6599 13.1226 21.5069 13.2308C20.6572 13.2044 19.8168 13.4137 19.0787 13.8356C18.8245 14.0328 18.6385 14.3046 18.5468 14.613C18.4551 14.9213 18.4624 15.2506 18.5675 15.5546C18.7493 15.9866 19.2479 16.1252 19.6565 16.253C22.0074 16.8686 24.4986 16.8074 26.8026 17.6156C27.2976 17.7534 27.7545 18.0027 28.1383 18.3443C28.5221 18.686 28.8225 19.1109 29.0167 19.5867C29.2477 20.2613 29.3034 20.9836 29.1788 21.6858C29.0541 22.3879 28.753 23.0469 28.3038 23.6007C27.4912 24.445 26.4353 25.0145 25.2834 25.2298C23.7833 25.5346 22.2445 25.6002 20.7239 25.4242C19.2646 25.3404 17.8656 24.8135 16.7135 23.9139C16.2571 23.4946 15.8989 22.9797 15.6646 22.4059C15.4303 21.8321 15.3256 21.2136 15.3581 20.5947C15.3694 20.4954 15.4194 20.4046 15.4972 20.3419C15.5751 20.2792 15.6745 20.2498 15.7739 20.2599C16.3445 20.2545 16.9133 20.2527 17.4839 20.2599C17.5367 20.2589 17.5891 20.2684 17.6382 20.2879C17.6873 20.3073 17.732 20.3363 17.7698 20.3731C17.8077 20.4099 17.8378 20.4539 17.8586 20.5024C17.8793 20.5509 17.8902 20.6031 17.8907 20.6559C17.9188 21.0088 18.0188 21.3522 18.1848 21.6648C18.3507 21.9775 18.579 22.2529 18.8555 22.4739C20.0755 23.0743 21.4389 23.3224 22.7922 23.1903C23.9252 23.2768 25.0563 23 26.0214 22.4001C26.2438 22.1833 26.4056 21.912 26.4909 21.6133C26.5761 21.3147 26.5818 20.9989 26.5074 20.6973C26.367 20.1933 25.8414 19.9593 25.3896 19.8063C23.0676 19.0719 20.5511 19.3383 18.2525 18.5103C17.7704 18.3688 17.3248 18.1245 16.9463 17.7942C16.5678 17.4638 16.2654 17.0553 16.0601 16.5968C15.7961 15.9131 15.7294 15.1689 15.8675 14.4491C16.0056 13.7293 16.343 13.0627 16.8413 12.5252C17.9274 11.5661 19.3104 11.0099 20.7581 10.9502Z" fill="#C6CBD2"/>
</svg>
