<svg width="36" height="36" viewBox="0 0 36 36" fill="none" xmlns="http://www.w3.org/2000/svg">
<path d="M35.3205 16.3957L19.602 0.677232C19.3868 0.461911 19.1313 0.291103 18.8501 0.174566C18.5688 0.0580287 18.2674 -0.00195312 17.9629 -0.00195312C17.6585 -0.00195312 17.357 0.0580287 17.0758 0.174566C16.7945 0.291103 16.539 0.461911 16.3238 0.677232L12.672 4.32898L15.4193 7.07623C16.0494 6.7742 16.7577 6.67519 17.4465 6.79286C18.1352 6.91054 18.7705 7.23909 19.2646 7.73318C19.7587 8.22727 20.0872 8.86253 20.2049 9.5513C20.3226 10.2401 20.2236 10.9484 19.9215 11.5785L24.4215 16.0785C25.14 15.7353 25.9566 15.6572 26.727 15.8579C27.4975 16.0586 28.1722 16.5252 28.6318 17.1753C29.0915 17.8253 29.3066 18.617 29.239 19.4102C29.1715 20.2035 28.8257 20.9474 28.2627 21.5104C27.6997 22.0734 26.9559 22.4192 26.1626 22.4867C25.3693 22.5543 24.5776 22.3392 23.9276 21.8795C23.2775 21.4198 22.8109 20.7451 22.6102 19.9747C22.4095 19.2042 22.4876 18.3876 22.8308 17.6692L18.3308 13.1692C18.2229 13.2205 18.1125 13.2664 18 13.3065V22.6912C18.7507 22.9566 19.3833 23.4788 19.7861 24.1655C20.189 24.8522 20.3361 25.6593 20.2014 26.4439C20.0668 27.2286 19.6591 27.9404 19.0504 28.4536C18.4417 28.9668 17.6712 29.2482 16.875 29.2482C16.0789 29.2482 15.3084 28.9668 14.6997 28.4536C14.091 27.9404 13.6833 27.2286 13.5487 26.4439C13.414 25.6593 13.5611 24.8522 13.964 24.1655C14.3668 23.4788 14.9994 22.9566 15.75 22.6912V13.3065C15.3037 13.1488 14.8954 12.8991 14.5519 12.5734C14.2083 12.2477 13.9372 11.8534 13.7559 11.416C13.5747 10.9787 13.4875 10.5081 13.5001 10.0349C13.5126 9.56169 13.6245 9.09638 13.8285 8.66923L11.0813 5.92198L0.679546 16.3237C0.245097 16.7591 0.00109863 17.349 0.00109863 17.964C0.00109863 18.579 0.245097 19.1689 0.679546 19.6042L16.398 35.3227C16.6133 35.5381 16.8688 35.7089 17.15 35.8254C17.4313 35.9419 17.7327 36.0019 18.0372 36.0019C18.3416 36.0019 18.6431 35.9419 18.9243 35.8254C19.2056 35.7089 19.4611 35.5381 19.6763 35.3227L35.3205 19.6785C35.755 19.2432 35.999 18.6533 35.999 18.0382C35.999 17.4232 35.755 16.8333 35.3205 16.398V16.3957Z" fill="#C6CBD2"/>
</svg>
