<?xml version="1.0" encoding="UTF-8" standalone="no"?>
<svg
   xmlnsDc="http://purl.org/dc/elements/1.1/"
   xmlnsCc="http://creativecommons.org/ns#"
   xmlnsRdf="http://www.w3.org/1999/02/22-rdf-syntax-ns#"
   xmlnsSvg="http://www.w3.org/2000/svg"
   xmlns="http://www.w3.org/2000/svg"
   id="SVGRoot"
   version="1.1"
   viewBox="0 0 118.53333 125.58889"
   height="445"
   width="420">
  <defs
     id="defs5851">
    <clipPath
       id="clipPath3696"
       clipPathUnits="userSpaceOnUse">
      <path
         id="path3694"
         d="M 0,500 500,500 500,0 0,0 Z" />
    </clipPath>
  </defs>
  
  <g
     transform="translate(-14.096003,-70.948669)"
     id="layer1">
    <g
       id="g8706">
      <g
         style="opacity:0.53699999;fill:#98ebb6;fill-opacity:1"
         id="layer1-89"
         transform="matrix(1.7065926,0,0,2.2843178,-576.99147,-92.847644)" />
      <g
         id="g5290"
         transform="matrix(0.09886096,0,0,0.12240453,67.922691,68.74106)">
        <g
           id="g5229"
           transform="matrix(6.0582511,0,0,5.4894211,3850.5269,-7437.8763)">
          <path
             style="fill:#800000;fill-opacity:1;stroke-width:1.25"
             d="m -592.7979,1542.4208 c -3.43173,-0.6442 -7.13227,-1.9793 -8.22342,-2.9668 -1.09114,-0.9875 -2.3241,-1.7954 -2.73991,-1.7954 -0.4158,0 -3.48882,-1.6988 -6.82892,-3.7751 -5.03626,-3.1307 -7.4509,-3.7938 -14.14556,-3.8847 -4.43996,-0.06 -9.63604,-0.9157 -11.54686,-1.9009 -1.91081,-0.9853 -4.1071,-1.4003 -4.88063,-0.9222 -0.77354,0.478 -1.07884,0.3391 -0.67845,-0.3087 0.40039,-0.6479 -0.82745,-1.8664 -2.72855,-2.7079 -1.90109,-0.8415 -4.15094,-2.789 -4.99966,-4.3278 -0.84872,-1.5387 -3.14861,-3.9227 -5.11085,-5.2977 -1.96225,-1.375 -12.94164,-7.1193 -16.77374,-9.7948 -3.83211,-2.6754 -6.96747,-5.5608 -6.96747,-6.4119 0,-1.9786 -9.69296,-9.9461 -13.60266,-11.1812 -2.30106,-0.7269 -2.58509,-1.1893 -1.25,-2.0349 1.31133,-0.8305 1.10329,-1.0988 -0.86327,-1.1133 -2.79859,-0.021 -0.85635,-4.8803 -2.37854,-12.191 -0.76312,-3.665 -3.00066,-6.1718 -18.91541,-21.1917 -3.6,-3.3976 -5.63908,-11.0711 -4.43931,-16.7062 0.51232,-2.4062 0.38508,-6.779 -0.28276,-9.7171 -0.96868,-4.2618 -0.79108,-6.2296 0.87813,-9.7299 2.67041,-5.5999 2.6519,-8.053 -0.0607,-8.053 -1.83081,0 -1.76304,-0.2732 0.45273,-1.8252 1.43322,-1.0039 3.26552,-3.4178 4.07177,-5.3643 1.48712,-3.5902 6.76874,-7.0861 12.84914,-8.5048 5.21172,-1.216 7.11648,-4.3427 8.47323,-13.909 1.48535,-10.4731 3.32249,-15.8432 5.05392,-14.7731 1.65937,1.0255 1.58249,7.5207 -0.21808,18.4236 l -1.47042,8.9037 5.32282,4.5843 c 2.92754,2.5214 5.99394,5.9356 6.81421,7.5871 0.82026,1.6515 2.74293,3.1825 4.2726,3.4021 1.52966,0.2197 2.78121,1.0166 2.78121,1.7709 0,0.7542 -0.37012,1.0013 -0.82249,0.5489 -0.45237,-0.4524 -1.53287,-0.2329 -2.40112,0.4876 -1.25888,1.0448 -1.15558,2.1187 0.50999,5.3017 1.14874,2.1953 2.514,4.1802 3.03391,4.4108 0.51991,0.2306 0.64264,0.9089 0.27273,1.5074 -1.03206,1.67 2.48478,8.8723 6.4639,13.2379 6.91179,7.583 9.82106,11.7667 10.1087,14.5367 1.16483,11.2177 2.57018,14.9254 7.05988,18.6263 5.18386,4.2729 9.5245,11.8609 9.5245,16.6499 0,2.5466 1.55688,4.2083 7.6064,8.1183 12.05891,7.794 23.55205,16.793 23.16963,18.1415 -0.49342,1.7399 4.03451,5.0087 9.32793,6.734 4.20628,1.3711 18.6346,7.4623 18.6346,9.5319 0,0.5165 2.39063,1.2505 5.3125,1.6311 8.54815,1.1134 13.85293,4.2067 16.8124,5.5712 1.50615,0.6945 5.0568,0.892 7.89034,0.4389 2.83354,-0.4531 7.49788,-0.1921 10.3652,0.58 l 5.21333,1.4038 -3.3486,2.8803 c -1.84174,1.5842 -6.33214,3.5642 -9.97867,4.3999 -8.32503,1.9079 -38.3167,2.5377 -46.6196,0.9788 z"
             id="path5221" />
          <path
             style="fill:#427142;fill-opacity:1;stroke-width:1.25"
             d="m -708.03132,1411.0108 c -2.6186,-3.329 -7.50011,-5.0247 -8.36842,-2.907 -0.4038,0.9848 -0.61696,0.9435 -0.68494,-0.1327 -0.0543,-0.8594 -1.06759,-1.5625 -2.25181,-1.5625 -1.83081,0 -1.76304,-0.2732 0.45273,-1.8252 1.43322,-1.0039 3.26552,-3.4178 4.07177,-5.3643 1.48712,-3.5902 6.76874,-7.0861 12.84914,-8.5048 5.21172,-1.216 7.11648,-4.3427 8.47323,-13.909 1.48535,-10.4731 3.32249,-15.8432 5.05392,-14.7731 1.65937,1.0255 1.58249,7.5207 -0.21808,18.4236 l -1.47042,8.9037 5.32282,4.5843 c 2.92754,2.5214 5.99394,5.9356 6.81421,7.5871 0.82026,1.6515 2.74293,3.1825 4.2726,3.4021 1.52966,0.2197 2.78121,0.9561 2.78121,1.6363 0,0.6803 -0.52363,0.9132 -1.16363,0.5177 -0.63999,-0.3955 -1.52761,-0.1302 -1.97247,0.5896 -0.46916,0.7591 -2.56009,0.9802 -4.97875,0.5264 -3.35941,-0.6302 -4.42703,-0.3018 -5.4928,1.6896 -1.92318,3.5935 -4.79728,4.2587 -9.00338,2.0836 -3.32746,-1.7207 -3.98096,-1.7198 -6.44895,0.01 -3.74194,2.6209 -5.36472,2.4242 -8.03798,-0.9743 z"
             id="path5227" />
        </g>
      </g>
    </g>
  </g>
</svg>
