"VertexlitGeneric"
{
	"$basetexture" "models/vtalanov98/turquoise_prank/windows"
	"$bumpmap" "models/vtalanov98/turquoise_prank/windowsn"
	"$envmap" "env_cubemap"
	"$envmaptint" "[0.05 0.05 0.05]"
	//"$envmaptint" "[0.5 0.7 0.7]"
	"$phong" "1"
	"$phongexponent" "150"
	"$phongboost" "1"
	"$phongfresnelranges" "[0.05 0.5 1]"
	"$selfillum" "1"
	"$selfillummask" "models/vtalanov98/turquoise_prank/white"
}