"VertexlitGeneric"
{
	"$basetexture" "models/cem/toyota_smith/ceilingl_off"
	"$bumpmap" "models/cem/toyota_smith/generic_normal"
	"$surfaceprop" "Plastic"
	"$nodecal" "1"

	"$phong"     "1"
	"$phongexponent"  "63"
	"$phongboost"   "0.5"
	"$phongfresnelranges"   "[1 8 4]"
	"$phongtint"	"[ .5 .5 .5 ]"
	"$halflambert" "1"

	"$rimlight" "1"
	"$rimlightexponent" "12"	
	"$rimlightboost" "0.8"
}
