"VertexLitGeneric"
{
	"$basetexture" "models/cem/toyota_smith/sonic_charger_lights"
	"$bumpmap" "models/cem/toyota_smith/generic_normal"
	"$surfaceprop" "Plastic"
	"$nodecal" "1"
	"$color2" "[0.25 0.25 0.25]"

	"$phong"     "1"
	"$phongexponent"  "15"
	"$phongboost"   "0.1"
	"$phongfresnelranges"   "[1 8 4]"
	"$phongtint"	"[ .5 .5 .5 ]"
	"$halflambert" "1"

	"$rimlight" "1"
	"$rimlightexponent" "12"
	"$rimlightboost" "0.8"
}
