"VertexlitGeneric"
{
	"$basealphaenvmapmask" "1"
	"$basetexture" "models/doctorwho1200/toyota/2013/exterior"
	"$envmap" "models/doctorwho1200/toyota/environment"
	"$envmaptint" "[0.3 0.3 0.3]"
	"$nodecal" "1"
	"$surfaceprop" "Wood_Solid"
}