"VertexlitGeneric"
{
	"$basetexture" "models/cem/toyota_smith/trimlower"
	"$bumpmap" "models/cem/toyota_smith/floor_normal"
	"$surfaceprop" "Metal"
	"$nodecal" "1"
	"$envmap" "models/cem/toyota_smith/environment"
	"$envmaptint" "[0.01 0.01 0.01]"

	$phong 					1
	$phongexponent 			75
	$phongboost 			25
	$phongtint 				"[ .35 .35 .35 ]"
	$phongfresnelranges 	"[0.05 0.5 1]"

}
