"VertexlitGeneric"
{
	"$basetexture" "models/cem/toyota_capaldi/catwalklightslow"
	"$surfaceprop" "Plastic"
	"$selfillum" 1
	"$selfillummask" "models/cem/toyota_smith/white"
	"$nodecal" "1"

		"Proxies"
		{
			"AnimatedTexture"
				{
					"animatedTextureVar" "$basetexture"
					"animatedTextureFrameNumVar" "$frame"
					"animatedTextureFrameRate" "5"
				}
		}
}