"VertexlitGeneric"
{
	"$basetexture" "models/cem/toyota_smith/mainfloor"
	"$bumpmap" "models/cem/toyota_smith/railsm_normal"
	"$surfaceprop" "Metal"
	"$nodecal" "1"
	"$envmap" "models/cem/toyota_smith/metal_env"
	"$envmaptint" "[0.1 0.15 0.1]"
	"$color2" "[0.75 0.75 0.75]"
	"$nocull" "1"

	$phong 					1
	$phongexponent 			75
	$phongboost 			55
//	$phongtint 				"[ .35 .35 .35 ]"
	$phongfresnelranges 	"[0.05 0.5 1]"
}
