"VertexlitGeneric"
{
	"$basetexture" "models/doctorwho1200/hellbent/floor2"
	"$envmap" "models/doctorwho1200/hellbent/environment"
	"$envmaptint" "[0.4 0.4 0.4]"
	"$nodecal" "1"
	"$surfaceprop" "Metal"
}
