"VertexlitGeneric"
{
	"$basetexture" "models/doctorwho1200/hellbent/roundel"
	"$nodecal" "1"
	"$selfillum" 1
	"$selfillumtint" "[0.8 0.8 0.8]"
	"$selfillummask" "models/doctorwho1200/hellbent/white"
	"$surfaceprop" "Plastic"
}
