"vertexlitgeneric"
{
	"$additive" 1
	"$basetexture" "models/doctorwho1200/hellbent/glass"
	"$envmap" "models/doctorwho1200/hellbent/environment"
	"$envmaptint" "[ 0.4 0.4 0.4 ]"
	"$nodecal" "1"
	"$translucent" 1
}
