"VertexlitGeneric"
{
	"$basetexture" "models/doctorwho1200/hellbent/computerbankslights"
	"$nodecal" "1"
	"$selfillum" 0
	"$selfillummask" "models/doctorwho1200/hellbent/white"
	"$surfaceprop" "Plastic"
}
