"VertexlitGeneric"
{
	"$basetexture" "models/doctorwho1200/hellbent/rotorlights"
	"$nodecal" "1"
	"$surfaceprop" "Plastic"
	Proxies
	{
		"AnimatedTexture"
			{
				"animatedTextureVar" "$basetexture"
				"animatedTextureFrameNumVar" "$frame"
				"animatedTextureFrameRate" "7"
			}
	}
}
