"VertexLitGeneric"
{
	"$basetexture" "models/doctorwho1200/hellbent/glass"
	"$color2" "[0.5 0.5 0.5]"
	"$surfaceprop" "Glass"
	"$envmap" "models/doctorwho1200/hellbent/environment"
	"$envmaptint" "[0.7 0.7 0.7]"
	"$nodecal" "0"
	"$additive" "1"
	"$translucent" "1"
}
