"VertexlitGeneric"
{
	"$basetexture" "models/doctorwho1200/hellbent/meters"
	"$envmap" "models/doctorwho1200/hellbent/environment"
	"$envmaptint" "[0.3 0.3 0.3]"
	"$nodecal" "1"
	"$surfaceprop" "Metal"

	"$selfillum" "1"
	"$selfillummask" "models/doctorwho1200/hellbent/white"
	"$selfillumtint" "[ 10 10 10 ]"

}
