"VertexlitGeneric"
{
	"$basetexture" "models/doctorwho1200/hellbent/wall6"
	"$envmap" "models/doctorwho1200/hellbent/environment"
	"$envmaptint" "[0.3 0.3 0.3]"
	"$nocull" "1"
	"$nodecal" "1"
	"$surfaceprop" "Metal"
}
