"VertexlitGeneric"
{
	"$basetexture" "models/doctorwho1200/copper/rewrite/doorsign"
	"$surfaceprop" "Plastic"
	"$selfillum" 1
        "$selfillummask" "models/doctorwho1200/copper/rewrite/white"
	"$nodecal" "1"
}
