"VertexlitGeneric"
{
	"$basetexture"			"models/doctorwho1200/copper/curvedwallroundel"
	"$bumpmap"				"models/doctorwho1200/copper/curvedwallroundel_n"
	"$nodecal"				"1"
	"$nocull"				"1"
	"$model"				"1"

	"$phong"				"1"
	"$phongexponent"		"5"
	"$phongboost"			"3"
	"$phongfresnelranges"	"[0.05 0.5 1]"

	"$rimlight"				"1"
	"$rimlightexponent"		"2"
	"$rimlightboost"		"0.2"

	"$color2"				"[2.3 2.0 0.8]"

	"$surfaceprop"			"plastic"
}