"VertexlitGeneric"
{
	"$basetexture"			"models/doctorwho1200/copper/woodfloor"
	"$bumpmap"				"models/doctorwho1200/copper/woodfloor_n"
	"$nodecal"				"1"
	"$model"				"1"

	"$phong"				"1"
	"$phongexponent"		"30"
	"$phongboost"			"1"
	"$phongfresnelranges"	"[0.05 0.5 1]"

	"$surfaceprop"			"Wood_Plank"
}