"VertexlitGeneric"
{
	"$basetexture"			"models/doctorwho1200/copper/corridor"
	"$bumpmap"				"models/doctorwho1200/copper/normal"
	"$nodecal"				"1"
	"$model"				"1"
	
	"$phong"				"1"

	"$surfaceprop"			"plastic"

	"$color2"				"[7 7 6.5]"
}