"VertexlitGeneric"
{
	"$basetexture" "models/doctorwho1200/tennant/rewrite/TardisFloorGrate"
	"$bumpmap" "models/doctorwho1200/tennant/rewrite/TardisFloorGrate_NRM"
	"$translucent" 1
	"$surfaceprop" "Metal"
	"$nodecal" 1
}
