"VertexlitGeneric"
{
	"$basetexture" "models/doctorwho1200/tennant/rewrite/screen"
	"$surfaceprop" "Metal"
               "Proxies"
                {
                  "AnimatedTexture"
                  {
                             "animatedtexturevar" "$basetexture"
                             "animatedtextureframenumvar" "$frame"
                             "animatedtextureframerate" "8"
                  }
                }
	"$nodecal" "1"
	"$selfillummask" "models/doctorwho1200/tennant/rewrite/white"
	"$selfillum" 1
}