"VertexlitGeneric"
{
	"$basetexture" "models/doctorwho1200/tennant/rewrite/2005spray"
	"$bumpmap" "models/doctorwho1200/tennant/rewrite/2005n"
	"$normalmap" "models/doctorwho1200/tennant/rewrite/2005n"
	"$surfaceprop" "Wood_Solid"
}
