"VertexlitGeneric"
{
	"$basetexture" "models/doctorwho1200/coral/consolecentre"
	"$surfaceprop" "Glass"
	"$selfillum" 1
	"$selfillummask" "models/doctorwho1200/coral/white"
	"$selfillumtint" "[ 4 0.0 0.0 ]"
	"$nodecal" "1"
}
