"VertexlitGeneric"
{
	"$basetexture" "models/doctorwho1200/baker/windows"
	"$bumpmap" "models/doctorwho1200/baker/windowsn"
	"$normalmap" "models/doctorwho1200/baker/windowsn"
	"$surfaceprop" "Glass"
	"$selfillum" 1
        "$selfillummask" "models/doctorwho1200/baker/white"
	"$envmap" "models/doctorwho1200/baker/environment"
	"$envmaptint" "[0.5 0.5 0.5]"
	"$nodecal" "1"
}