"VertexlitGeneric"
{
	"$basealphaenvmapmask" "1"
	"$basetexture" "models/doctorwho1200/hartnell/vtf/floor2"
	"$envmap" "models/doctorwho1200/hartnell/vtf/environment"
	"$envmaptint" "[0.7 0.7 0.7]"
	"$nodecal" "1"
	"$surfaceprop" "Concrete"
}