"VertexlitGeneric"
{
	"$basetexture" "models/doctorwho1200/hartnell/vtf/screen"
	"$envmap" "models/doctorwho1200/hartnell/vtf/environment"
	"$envmaptint" "[0.5 0.5 0.5]"
	"$nodecal" "1"
	"$surfaceprop" "Glass"
	Proxies
	{
		"AnimatedTexture"
			{
				"animatedTextureVar" "$basetexture"
				"animatedTextureFrameNumVar" "$frame"
				"animatedTextureFrameRate" "15"
			}
	}
}