"VertexlitGeneric"
{
	"$basealphaenvmapmask" "1"
	"$basetexture" "models/doctorwho1200/hartnell/vtf/lock"
	"$envmap" "models/doctorwho1200/hartnell/vtf/environment"
	"$envmaptint" "[0.5 0.5 0.5]"
	"$nodecal" "1"
	"$surfaceprop" "Metal"
}
