"VertexlitGeneric"
{
	"$basetexture" "models/doctorwho1200/hartnell/vtf/roofoption"
	"$nodecal" "1"
	"$nocull" "1"
	"$surfaceprop" "Plastic"
	"$color2" "[1.1 1.05 1.1]"
	"$envmap" "models/doctorwho1200/hartnell/vtf/environment"
	"$envmaptint" "[0.5 0.2 0.1]"
}
