"VertexlitGeneric"
{
	"$basetexture" "models/doctorwho1200/hartnell/vtf/exteriorsnow"
	"$bumpmap" "models/doctorwho1200/hartnell/vtf/exteriorn"
	"$nodecal" "1"
	"$normalmap" "models/doctorwho1200/hartnell/vtf/exteriorn"
	"$surfaceprop" "Wood_Solid"
}
