"VertexlitGeneric"
{
	"$basetexture" "models/doctorwho1200/hartnell/vtf/controls"
	"$envmap" "models/doctorwho1200/hartnell/vtf/environment"
	"$envmaptint" "[0.5 0.5 0.5]"
	"$nodecal" "1"
	"$surfaceprop" "Metal"
}
