"VertexlitGeneric"
{
	"$basetexture" "models/doctorwho1200/hartnell/vtf/roofoption"
	"$envmap" "models/doctorwho1200/hartnell/vtf/environment"
	"$envmaptint" "[0.4 0.4 0.4]"
	"$nodecal" "1"
	"$nocull" "1"
	"$surfaceprop" "Plastic"
	"$color2" "[2.5 2.5 2.5]"
}
