"VertexlitGeneric"
{
	"$basetexture" "models/doctorwho1200/hartnell/vtf/lqdoorlight"
	"$nodecal" "1"
	"$selfillum" "1"
	"$selfillummask" "models/doctorwho1200/hartnell/vtf/white"
	"$surfaceprop" "Plastic"
}
