"VertexlitGeneric"
{
	"$basetexture" "models/doctorwho1200/sonics/12thdoctor/sonic"
	"$envmap" "models/doctorwho1200/sonics/12thdoctor/environment"
	"$envmaptint" "[0.5 0.5 0.5]"
	"$nodecal" "1"
	"$surfaceprop" "Metal"
}
