"VertexlitGeneric"
{
	"$basetexture" "models/vtalanov98old/capaldioldsonic/emmiter"
	"$surfaceprop" "Metal"
	"$nodecal" "1"
	"$selfillummask" "models/vtalanov98old/capaldioldsonic/white"
	"$selfillum" 1
"Proxies" 
{ 
"AnimatedTexture" 
{ 
"animatedTextureVar" "$basetexture" 
"animatedTextureFrameNumVar" "$frame" 
"animatedTextureFrameRate" "8" 
}
} 
}
}
