"VertexlitGeneric"
{
	"$additive" 1
	"$basetexture" "models/vtalanov98old/capaldi/consoleglass"
	"$surfaceprop" "Glass"
	"$selfillummask" "models/vtalanov98old/capaldi/white"
	"$selfillum" 1
	"$translucent" 1
	"$nodecal" "1"
}