"VertexlitGeneric"
{
	"$basetexture" "models/vtalanov98old/hartnell/faultlocator"
	"$bumpmap" "models/vtalanov98old/hartnell/faultlocatorn"
	"$normalmap" "models/vtalanov98old/hartnell/faultlocatorn"
	"$surfaceprop" "Metal"
}
