"VertexlitGeneric"
{
	"$basetexture" "models/vtalanov98old/toyota/2013snow"
	"$bumpmap" "models/vtalanov98old/toyota/2013n"
	"$normalmap" "models/vtalanov98old/toyota/2013n"
	"$surfaceprop" "Wood_Solid"
	"$nodecal" "1"
}
