"vertexlitgeneric"
{
	"$translucent" 1
	"$basetexture" "models\doctormemes\keltyj\Speaker Glass"
	"$bumpmap" "models\doctormemes\keltyj\Speaker GlassN"
	"$envmap" "models/doctormemes/keltyj/environment"
	"$envmaptint" "[ 0.1 0.1 0.1 ]"
	"$nodecal" "1"
}
