"VertexLitGeneric"
{
	"$basetexture" "models/doctormemes/keltyj/Exterior 2"
	"$surfaceprop"	"Wood_Solid"
        "$nodecal" "1"
	"$bumpmap" "models/doctormemes/keltyj/Exterior 2N"

	$phong 1
	$phongexponent			30
	$phongboost			0.25
	$phongfresnelranges	"[0.25 0.25 0.25]"

}
