"VertexlitGeneric"
{
	"$basetexture" "models/doctormemes/newbarp/Black Cover"
	"$surfaceprop" "Plastic"
	"$nodecal" "1"
	"$envmap" "models\doctormemes\newbarp\environment"
	"$envmaptint" "[ 0.1 0.1 0.1 ]"
}
