"VertexlitGeneric"
{
	"$basetexture" "models/doctormemes/newbarp/Console Upper"
	"$surfaceprop" "Plastic"
	"$bumpmap" "models/doctormemes/newbarp/Console UpperN"
	"$nodecal" "1"

	$phong 1
	$phongexponent			20
	$phongboost			0.15
	$phongfresnelranges	"[1 1 1]"
}
