"VertexlitGeneric" 
{ 
"$basetexture" "models/doctormemes/newbarp/rotor led (on)" 
"$surfaceprop" "Glass"
"$nodecal" "1" 
"$selfillum" "1"
"Proxies" 
{ 
"AnimatedTexture" 
{ 
"animatedTextureVar" "$basetexture" 
"animatedTextureFrameNumVar" "$frame" 
"animatedTextureFrameRate" "25" 
} 
} 
}