"VertexLitGeneric"
{
	"$basetexture" "models/doctormemes/newbarp/Exterior"
	"$bumpmap" "models/doctormemes/newbarp/ExteriorN"	
	"$envmap" env_cubemap
	"$envmaptint" "[0.2 0.2 0.2]"
	"$surfaceprop" "glass"
	"$nodecal" 1
}
