"VertexlitGeneric"
{
	"$basetexture" "models/doctormemes/newbarp/Round Screen"
	"$bumpmap" "models/doctormemes/newbarp/Round ScreenN"
	"$surfaceprop" "Glass"
	"$nodecal" "1"
//	"$envmap" "models\doctormemes\newbarp\environment"
//	"$envmaptint" "[ 0.2 0.2 0.2 ]"

	$phong 1
	$phongexponent			10
	$phongboost			1
	$phongfresnelranges	"[0.3 0.3 0.3]"
}
