"VertexlitGeneric"
{
	"$basetexture" "models/doctormemes/riversonic/Copper"
	"$surfaceprop" "concrete"
	"$bumpmap" "models/doctormemes/riversonic/CopperN"
	"$nodecal" "1"

	$phong 1
	$phongexponent			40
	$phongboost			0.1
	$phongfresnelranges	"[0.1 0.1 0.1]"
}
