"VertexlitGeneric"
{
	"$basetexture" "models/doctormemes/customsmithsonic/Silver with Stripes"
	"$surfaceprop" "Metal"
	"$bumpmap" "models/doctormemes/customsmithsonic/Silver with StripesN"
	"$nodecal" "1"
	"$envmap" "models/doctormemes/shared/environment"
	"$envmaptint" "[ 0.06 0.06 0.06 ]"

	$phong 1
	$phongexponent			20
	$phongboost			0.1
	$phongfresnelranges	"[0.5 0.5 0.5]"
}
