"VertexLitGeneric"
{
	"$basetexture" "models/doctormemes/jodiesonic/Screwdriver"
	"$surfaceprop" "Metal"
	"$bumpmap" "models/doctormemes/jodiesonic/ScrewdriverN"
	"$envmap" "models/doctormemes/shared/environment"
	"$envmaptint" "[0.3 0.3 0.3]"
        "$nodecal" "1"
}
