"VertexLitGeneric"
{
	"$basetexture" "models/doctormemes/customorangesonic/Emitter"
	"$envmap" "models/doctormemes/shared/environment"
	"$envmaptint" "[ 0.1 0.1 0.1 ]"
	"$nodecal" "1" 
	"$surfaceprop" "ice"
	"$selfillum" "1"

	Proxies
	{
		SonicSDColor
		{
			resultVar	$selfillumtint
	}
}


