"VertexLitGeneric"
{
	"$basetexture" "models/doctormemes/transsonic/uzor"
	"$surfaceprop" "Metal"
	"$bumpmap" "models/doctormemes/transsonic/uzorN"
	"$envmap" "models/doctormemes/shared/environment"
	"$envmaptint" "[0.1 0.1 0.1]"
        "$nodecal" "1"
}
