"VertexLitGeneric"
{
	"$basetexture" "models/doctormemes/mcsonic/Screwdriver"
	"$surfaceprop" "ice"
	"$bumpmap" "models/doctormemes/mcsonic/ScrewdriverN"
	"$envmap" "models/doctormemes/shared/environment"
	"$envmaptint" "[0.3 0.3 0.3]"
        "$nodecal" "1"
	"$selfillum" "1"
	Proxies
	{
		SonicSDColor
		{
			resultVar	$selfillumtint
		}
	}
}
