"VertexLitGeneric"
{
	"$basetexture" "models/doctormemes/custombluesonic/White Handle"
	"$bumpmap" "models/doctormemes/custombluesonic/White HandleN"
	"$nodecal" "1" 
	"$envmap" "models/doctormemes/shared/environment"
	"$envmaptint" "[ 0.1 0.1 0.1 ]"
}