"VertexlitGeneric"
{
	"$basealphaenvmapmask" "1"
	"$basetexture" "models/doctorwho1200/hurt/police_box_sign_unlit"
	"$envmap" "models/doctorwho1200/hurt/environment"
	"$envmaptint" "[0.2 0.2 0.2]"
	"$nodecal" "1"
	"$surfaceprop" "Glass"
}