"VertexlitGeneric" 
{ 
"$basetexture" "models/doctormemes/hurt/Console Lamps Animated" 
"$nodecal" "1" 
"$selfillum" "1"
"$selfillummask" "models/doctormemes/hurt/white"
"Proxies" 
{ 
"AnimatedTexture" 
{ 
"animatedTextureVar" "$basetexture"
"animatedTextureFrameNumVar" "$frame" 
"animatedTextureFrameRate" "10" 
} 
} 
}