"VertexLitGeneric"
{
	"$basetexture" "models/doctormemes/hurt/Console Struts New"
	"$surfaceprop" "concrete"
        "$nodecal" "1"
	"$bumpmap" "models/doctormemes/hurt/Console Struts NewN"

	$phong 1
	$phongexponent			25
	$phongboost			0.15
	$phongfresnelranges	"[0.15 0.15 0.15]"
}
