"VertexLitGeneric"
{
	"$basetexture" "models/doctormemes/hurt/Trash 2"
	"$surfaceprop" "Metal"
        "$nodecal" "1"
	"$nocull" "1"
	"$envmap" "models/doctormemes/hurt/environment"
	"$envmaptint" "[0.1 0.1 0.1]"


}
